Ask Your Question
1

tum_simulator installation issue in ROS Indigo

asked 2015-03-26 06:52:06 -0500

saikishor gravatar image

updated 2015-06-14 15:09:46 -0500

ahendrix gravatar image

I am getting an error like below after cloning the contents from tum_simulator webpage to my ~/catkin_ws/src and then running the command catkin_make

make[1]: *** Waiting for unfinished jobs....
Architecture x86_64 is already built
Creating universal static lib file from architectures x86_64
make[2]: *** 
[tum_simulator/cvg_sim_gazebo_plugins/CMakeFiles/hector_gazebo_ros_magnetic.dir/src/gazebo_ros_magnetic.cpp.o] Error 1
make[1]: *** [tum_simulator/cvg_sim_gazebo_plugins/CMakeFiles/hector_gazebo_ros_magnetic.dir/all] Error 2
Build done.
Checking required Ubuntu packages ...
make[2]: *** [tum_simulator/cvg_sim_gazebo_plugins/CMakeFiles/diffdrive_plugin_6w.dir/src/diffdrive_plugin_6w.cpp.o] Error 1
make[1]: *** [tum_simulator/cvg_sim_gazebo_plugins/CMakeFiles/diffdrive_plugin_6w.dir/all] Error 2
ok.
Building ARDroneTool/Lib
Building ARDroneTool/Lib
[  3%] Performing install step for 'ardronelib'
make[3]: warning: jobserver unavailable: using -j1.  Add `+' to parent make rule.
[  3%] Completed 'ardronelib'
[  4%] Built target ardronelib
make: *** [all] Error 2
Invoking "make -j4 -l4" failed
edit retag flag offensive close merge delete

1 Answer

Sort by ยป oldest newest most voted
0

answered 2015-06-14 14:58:20 -0500

Tal gravatar image

please try tum_simulator for indigo https://github.com/dougvk/tum_simulator

edit flag offensive delete link more

Your Answer

Please start posting anonymously - your entry will be published after you log in or create a new account.

Add Answer

Question Tools

1 follower

Stats

Asked: 2015-03-26 06:52:06 -0500

Seen: 728 times

Last updated: Jun 14 '15