ROS Resources: Documentation | Support | Discussion Forum | Index | Service Status | ros @ Robotics Stack Exchange
Ask Your Question

Build failed in Jenkins

asked 2014-11-28 06:30:09 -0600

Hi there, I released the new ros packages using the bloom 0.5.12. But, Since the update the souredeb Jenkins job has been repeatedly failing.

Please See

Umm.. What should I do?

edit retag flag offensive close merge delete


Maybe you want to add the result of $ bloom-release --version to your description.

130s gravatar image 130s  ( 2014-11-28 10:55:27 -0600 )edit

1 Answer

Sort by ยป oldest newest most voted

answered 2014-11-28 07:07:42 -0600

gvdhoorn gravatar image

Please see Jenkins Build Errors.

dpkg-source: error: syntax error in ros-indigo-waypoints-navigation-0.0.1/debian/control at line 10: block lacks the 'Package' field
dpkg-buildpackage: error: dpkg-source -i -I --before-build ros-indigo-waypoints-navigation-0.0.1 gave error exit status 25
debuild: fatal error at line 1350:
dpkg-buildpackage -rfakeroot -d -us -uc -i -I -S failed
gbp:error: debuild -i -I returned 29
gbp:error: Couldn't run 'debuild -i -I -S -uc -us --lintian-opts --suppress-tags newer-standards-version'

You mention using Bloom 0.5.12, but the error message seems to be similar to the one copy/pasted in the post I referenced: are you sure you are using that version of bloom? Several updates have been released recently.

edit flag offensive delete link more


I checked the version of the bloom from

Daiki Maekawa gravatar image Daiki Maekawa  ( 2014-11-28 10:31:44 -0600 )edit

I'll try it from raising the version of bloom.

Daiki Maekawa gravatar image Daiki Maekawa  ( 2014-11-28 10:34:58 -0600 )edit

This problem was resolved thanks to your support. I was mistaken about this problem is inherent in the bloom 0.5.13. The solution was to use the bloom 0.5.14.

Daiki Maekawa gravatar image Daiki Maekawa  ( 2014-11-29 23:53:32 -0600 )edit

Question Tools

1 follower


Asked: 2014-11-28 06:30:09 -0600

Seen: 746 times

Last updated: Nov 28 '14