build cob_people_detection failed

asked 2016-04-01 06:11:35 -0600

xianke gravatar image

updated 2016-04-01 07:21:23 -0600

when I build the package of cob_people_detection, it give me the message:

/home/exbot/catkin/devel/lib/libNiTE2.so: error adding symbols: file format error
collect2: error: ld returned 1 exit status
make[2]: *** [/home/exbot/catkin/devel/lib/libbody_tracker_nodelet.so] error 1
make[1]: *** [cob_people_perception/cob_openni2_tracker/CMakeFiles/body_tracker_nodelet.dir/all] error 2
make[1]: *** waiting for the uncomplete task....
/home/exbot/catkin/devel/lib/libNiTE2.so: error adding symbols: file format error
collect2: error: ld returned 1 exit status
make[2]: *** [/home/exbot/catkin/devel/lib/cob_openni2_tracker/cob_body_tracker] error1
make[1]: *** [cob_people_perception/cob_openni2_tracker/CMakeFiles/cob_body_tracker.dir/all] error2
make: *** [all] error2

who can tell me how to solve it? I just be crazy.

edit retag flag offensive close merge delete

Comments

Please use the Preformatted text button when including console copy/pastes (it's the one with 101010 on it).

Also: this is an English forum: if possible, error messages in another language will probably make it hard(er) for forum visitors to help you.

gvdhoorn gravatar image gvdhoorn  ( 2016-04-01 06:59:12 -0600 )edit