Ask Your Question
1

catkin_make error invoking j8 -8

asked 2015-06-19 06:02:05 -0500

konan gravatar image

updated 2015-06-24 12:05:26 -0500

Dirk Thomas gravatar image

when i run catkin_make i get the following error: invoking "make -j8 -l8"failed. can someone help? This is what i get when i run catkin_make. I am very new to Ros

Generating dynamic reconfigure files from cfg/GeneralIO.cfg: /home/hand/workspace/devel/include/sr_ronex_drivers/GeneralIOConfig.h /home/hand/workspace/devel/lib/python2.7/dist-packages/sr_ronex_drivers/cfg/GeneralIOConfig.py
Generating dynamic reconfigure files from cfg/SPI.cfg: /home/hand/workspace/devel/include/sr_ronex_drivers/SPIConfig.h /home/hand/workspace/devel/lib/python2.7/dist-packages/sr_ronex_drivers/cfg/SPIConfig.py
../../catkin_generated/env_cached.sh: 16: exec: /home/hand/workspace/src/sr-ronex-indigo-devel/sr_ronex_drivers/cfg/GeneralIO.cfg: Permission denied
make[2]: *** [/home/hand/workspace/devel/include/sr_ronex_drivers/GeneralIOConfig.h] Error 126
make[2]: *** Waiting for unfinished jobs....
../../catkin_generated/env_cached.sh: 16: exec: /home/hand/workspace/src/sr-ronex-indigo-devel/sr_ronex_drivers/cfg/SPI.cfg: Permission denied
make[2]: *** [/home/hand/workspace/devel/include/sr_ronex_drivers/SPIConfig.h] Error 126
make[1]: *** [sr-ronex-indigo-devel/sr_ronex_drivers/CMakeFiles/sr_ronex_drivers_gencfg.dir/all] Error 2
make[1]: *** Waiting for unfinished jobs....
[  5%] [  5%] Built target sr_ronex_transmissions
[  5%] Built target gtest
[  5%] Built target nav_msgs_generate_messages_cpp
Built target nav_msgs_generate_messages_py
[  5%] Built target nav_msgs_generate_messages_lisp
[  5%] Built target _sr_edc_ethercat_drivers_generate_messages_check_deps_ActuatorInfo
[  5%] Built target _sr_edc_ethercat_drivers_generate_messages_check_deps_MotorTrace
edit retag flag offensive close merge delete

Comments

What's the output of ls -l /home/hand/workspace/src/sr-ronex-indigo-devel/sr_ronex_drivers/cfg/GeneralIO.cfg ?

jbohren gravatar image jbohren  ( 2015-06-19 08:49:32 -0500 )edit

hi, this is what i get : -rw-r--r-- 1 hand hand 2432 Feb 13 07:26 /home/hand/workspace/src/sr-ronex-indigo-devel/sr_ronex_drivers/cfg/GeneralIO.cfg

konan gravatar image konan  ( 2015-06-19 09:08:33 -0500 )edit

1 Answer

Sort by ยป oldest newest most voted
1

answered 2015-06-24 12:04:42 -0500

Dirk Thomas gravatar image

The problem is that your dynamic_reconfigure file cfg/SPI.cfg is not executable. Please look at the first tutorial for details: http://wiki.ros.org/dynamic_reconfigu...

edit flag offensive delete link more

Your Answer

Please start posting anonymously - your entry will be published after you log in or create a new account.

Add Answer

Question Tools

1 follower

Stats

Asked: 2015-06-19 06:02:05 -0500

Seen: 1,922 times

Last updated: Jun 24 '15