Ask Your Question

vijay's profile - activity

2012-11-01 19:39:42 -0500 received badge  Famous Question (source)
2012-10-26 01:17:03 -0500 received badge  Famous Question (source)
2012-10-16 12:31:40 -0500 commented answer ROS Core build on arch Linux

Hi All, Could anyone help me for the entries that Lorenz is talking about ? Thanks

2012-10-14 23:04:15 -0500 received badge  Notable Question (source)
2012-10-13 23:57:54 -0500 commented answer ROS Core build on arch Linux

Hi Lorenz, Could not find the # if BOOST_VERSION anywhere in the source :( i tried grep -rl '#if BOOST' .

2012-10-13 13:43:12 -0500 received badge  Student (source)
2012-10-13 01:59:15 -0500 received badge  Popular Question (source)
2012-10-12 00:21:22 -0500 commented question Arch x86_64 Linux ROS core build fails

Thanks Lorenz looks like that solved the python problem but now i face a boost problem i think http://answers.ros.org/question/45689/ros-core-build-on-arch-linux/

2012-10-12 00:08:39 -0500 asked a question ROS Core build on arch Linux

Hi all,

I get the following error when i build the ROS core on a arch linux x86_64 system. I do not know much but a bit of googling pointed me to believe that this could be a boost lib problem that should have been solved in version 1.50 of boost which i have installed but no luck. If someone could help me solve this would be helpful.

Thanks

The Error is below:

Building CXX object ros_comm/tools/rosbag/CMakeFiles/rosbag.dir/src/recorder.cpp.o
/home/zion/ros-underlay/ros_comm/tools/rosbag/src/recorder.cpp: In member function 'void rosbag::Recorder::doRecord()':
/home/zion/ros-underlay/ros_comm/tools/rosbag/src/recorder.cpp:439:42: error: expected unqualified-id before numeric constant
make[2]: *** [ros_comm/tools/rosbag/CMakeFiles/rosbag.dir/src/recorder.cpp.o] Error 1
make[1]: *** [ros_comm/tools/rosbag/CMakeFiles/rosbag.dir/all] Error 2
make: *** [all] Error 2
2012-10-12 00:03:21 -0500 received badge  Notable Question (source)
2012-10-12 00:02:49 -0500 received badge  Supporter (source)
2012-10-12 00:02:43 -0500 received badge  Scholar (source)
2012-10-10 23:30:54 -0500 commented question Arch x86_64 Linux ROS core build fails

Hi Lorenz, Thanks for your response, i tried cmake -DCMAKE_INSTALL_PREFIX=/opt/ros/fuerte -DSETUPTOOLS_DEB_LAYOUT=OFF -DPYTHON_EXECUTABLE=/usr/bin/python2 .. looked for any reference to python in the build directory there was none but i still get the same errro :( any ideas

2012-10-09 06:28:05 -0500 received badge  Popular Question (source)
2012-10-09 01:03:18 -0500 asked a question Arch x86_64 Linux ROS core build fails

Hi,

When i try to build the ROS core on Arch Linux x86_64 system i get the following error, if some one could help me solve this or at least point me in the rite direction would be very helpful

The error is below:

Linking CXX executable ../../bin/rxloggerlevel
[100%] Built target rxconsole
In file included from /tmp/yaourt-tmp-zion/aur-ros-core/src/ros-underlay/build/rx/rxtools/rosout_panel_swig_generated.cpp:3240:0:
/usr/include/wx-2.8/wx/wxPython/wxPython.h: In function 'bool wxPyCoreAPI_IMPORT()':
/usr/include/wx-2.8/wx/wxPython/wxPython.h:39:80: error: 'PyCObject_Import' was not declared in this scope
[100%] Built target rxloggerlevel
make[2]: *** [rx/rxtools/CMakeFiles/python_rxtools.dir/rosout_panel_swig_generated.cpp.o] Error 1
make[1]: *** [rx/rxtools/CMakeFiles/python_rxtools.dir/all] Error 2
make[1]: *** Waiting for unfinished jobs....
Linking CXX shared library ../../../lib/librosbag.so
[100%] Built target rosbag
make: *** [all] Error 2