Ask Your Question

Revision history [back]

Failed to process package 'pcl'

I get the following errors when executing ./src/catkin/bin/catkin_make_isolated --install as suggested by the build instructions for OS X (v10.8.2) <bit.ly 1331cvu="">.

The end of my shell log looks like:

/Users/alex/ros_catkin_ws/src/pcl/common/include/pcl/ros/register_point_struct.h:93:29: note: expanded from macro 'POINT_CLOUD_REGISTER_POINT_STRUCT_I'
      BOOST_PP_SEQ_FOR_EACH(POINT_CLOUD_REGISTER_FIELD_OFFSET, name, seq)        \
                            ^
/usr/local/include/boost/preprocessor/seq/for_each.hpp:26:67: note: expanded from macro 'BOOST_PP_SEQ_FOR_EACH'
#    define BOOST_PP_SEQ_FOR_EACH(macro, data, seq) BOOST_PP_FOR((macro, data, seq (nil)), BOOST_PP_SEQ_FOR_EACH_P, BOOST_PP_SEQ_FOR_EACH_O, BOOST_PP_SEQ_FOR_EACH_M)
                                                                  ^
note: (skipping 41 expansions in backtrace; use -fmacro-backtrace-limit=0 to see all)
/usr/local/include/boost/preprocessor/seq/for_each.hpp:49:57: note: expanded from macro 'BOOST_PP_SEQ_FOR_EACH_M_I'
# define BOOST_PP_SEQ_FOR_EACH_M_I(r, macro, data, seq) macro(r, data, BOOST_PP_SEQ_HEAD(seq))
                                                        ^
/Users/alex/ros_catkin_ws/src/pcl/common/include/pcl/ros/register_point_struct.h:121:33: note: expanded from macro 'POINT_CLOUD_REGISTER_FIELD_OFFSET'
    static const size_t value = offsetof(name, BOOST_PP_TUPLE_ELEM(3, 1, elem)); \
                                ^
/usr/bin/../lib/clang/4.2/include/stddef.h:62:24: note: expanded from macro 'offsetof'
#define offsetof(t, d) __builtin_offsetof(t, d)
                       ^
37 warnings and 2 errors generated.
make[2]: *** [common/test/CMakeFiles/test_operators.dir/test_operators.cpp.o] Error 1
make[1]: *** [common/test/CMakeFiles/test_operators.dir/all] Error 2
37 warnings generated.
Linking CXX executable test_wrappers
clang: warning: unknown warning option '-Wl'
37 warnings generated.
Linking CXX executable test_plane_intersection
[ 10%] Built target test_wrappers
clang: warning: unknown warning option '-Wl'
[ 10%] Built target test_plane_intersection
37 warnings generated.
Linking CXX executable test_pca
clang: warning: unknown warning option '-Wl'
[ 10%] Built target test_pca
make: *** [all] Error 2

<== Failed to process package 'pcl': 
  Command '/Users/alex/ros_catkin_ws/install_isolated/env.sh make -j8 -l8' returned non-zero exit status 2

Reproduce this error by running:
==> /Users/alex/ros_catkin_ws/install_isolated/env.sh make -j8 -l8

Command failed, exiting.

This seems to be a regression bug of some sort, judging by the fact that many people have had similar error messages before, though seemingly for different reasons (I checked the pcl_find_ros.cmake file and it looks up-to-date, since this seemed to be the culprit previously).

Any ideas here, folks?

Failed to process package 'pcl'

I get the following errors when executing ./src/catkin/bin/catkin_make_isolated --install as suggested by the build instructions for OS X (v10.8.2) <bit.ly 1331cvu="">.(see here)>.

The end of my shell log looks like:

/Users/alex/ros_catkin_ws/src/pcl/common/include/pcl/ros/register_point_struct.h:93:29: note: expanded from macro 'POINT_CLOUD_REGISTER_POINT_STRUCT_I'
      BOOST_PP_SEQ_FOR_EACH(POINT_CLOUD_REGISTER_FIELD_OFFSET, name, seq)        \
                            ^
/usr/local/include/boost/preprocessor/seq/for_each.hpp:26:67: note: expanded from macro 'BOOST_PP_SEQ_FOR_EACH'
#    define BOOST_PP_SEQ_FOR_EACH(macro, data, seq) BOOST_PP_FOR((macro, data, seq (nil)), BOOST_PP_SEQ_FOR_EACH_P, BOOST_PP_SEQ_FOR_EACH_O, BOOST_PP_SEQ_FOR_EACH_M)
                                                                  ^
note: (skipping 41 expansions in backtrace; use -fmacro-backtrace-limit=0 to see all)
/usr/local/include/boost/preprocessor/seq/for_each.hpp:49:57: note: expanded from macro 'BOOST_PP_SEQ_FOR_EACH_M_I'
# define BOOST_PP_SEQ_FOR_EACH_M_I(r, macro, data, seq) macro(r, data, BOOST_PP_SEQ_HEAD(seq))
                                                        ^
/Users/alex/ros_catkin_ws/src/pcl/common/include/pcl/ros/register_point_struct.h:121:33: note: expanded from macro 'POINT_CLOUD_REGISTER_FIELD_OFFSET'
    static const size_t value = offsetof(name, BOOST_PP_TUPLE_ELEM(3, 1, elem)); \
                                ^
/usr/bin/../lib/clang/4.2/include/stddef.h:62:24: note: expanded from macro 'offsetof'
#define offsetof(t, d) __builtin_offsetof(t, d)
                       ^
37 warnings and 2 errors generated.
make[2]: *** [common/test/CMakeFiles/test_operators.dir/test_operators.cpp.o] Error 1
make[1]: *** [common/test/CMakeFiles/test_operators.dir/all] Error 2
37 warnings generated.
Linking CXX executable test_wrappers
clang: warning: unknown warning option '-Wl'
37 warnings generated.
Linking CXX executable test_plane_intersection
[ 10%] Built target test_wrappers
clang: warning: unknown warning option '-Wl'
[ 10%] Built target test_plane_intersection
37 warnings generated.
Linking CXX executable test_pca
clang: warning: unknown warning option '-Wl'
[ 10%] Built target test_pca
make: *** [all] Error 2

<== Failed to process package 'pcl': 
  Command '/Users/alex/ros_catkin_ws/install_isolated/env.sh make -j8 -l8' returned non-zero exit status 2

Reproduce this error by running:
==> /Users/alex/ros_catkin_ws/install_isolated/env.sh make -j8 -l8

Command failed, exiting.

This seems to be a regression bug of some sort, judging by the fact that many people have had similar error messages before, though seemingly for different reasons (I checked the pcl_find_ros.cmake file and it looks up-to-date, since this seemed to be the culprit previously).

Any ideas here, folks?

Failed to process package 'pcl'

Note: links are disguised since the forum won't let me post them. Please recover them accordingly.

I get the following errors when executing ./src/catkin/bin/catkin_make_isolated --install as suggested by the build instructions for OS X (v10.8.2) (see here)>.>.

The end of my shell log looks like:

/Users/alex/ros_catkin_ws/src/pcl/common/include/pcl/ros/register_point_struct.h:93:29: note: expanded from macro 'POINT_CLOUD_REGISTER_POINT_STRUCT_I'
      BOOST_PP_SEQ_FOR_EACH(POINT_CLOUD_REGISTER_FIELD_OFFSET, name, seq)        \
                            ^
/usr/local/include/boost/preprocessor/seq/for_each.hpp:26:67: note: expanded from macro 'BOOST_PP_SEQ_FOR_EACH'
#    define BOOST_PP_SEQ_FOR_EACH(macro, data, seq) BOOST_PP_FOR((macro, data, seq (nil)), BOOST_PP_SEQ_FOR_EACH_P, BOOST_PP_SEQ_FOR_EACH_O, BOOST_PP_SEQ_FOR_EACH_M)
                                                                  ^
note: (skipping 41 expansions in backtrace; use -fmacro-backtrace-limit=0 to see all)
/usr/local/include/boost/preprocessor/seq/for_each.hpp:49:57: note: expanded from macro 'BOOST_PP_SEQ_FOR_EACH_M_I'
# define BOOST_PP_SEQ_FOR_EACH_M_I(r, macro, data, seq) macro(r, data, BOOST_PP_SEQ_HEAD(seq))
                                                        ^
/Users/alex/ros_catkin_ws/src/pcl/common/include/pcl/ros/register_point_struct.h:121:33: note: expanded from macro 'POINT_CLOUD_REGISTER_FIELD_OFFSET'
    static const size_t value = offsetof(name, BOOST_PP_TUPLE_ELEM(3, 1, elem)); \
                                ^
/usr/bin/../lib/clang/4.2/include/stddef.h:62:24: note: expanded from macro 'offsetof'
#define offsetof(t, d) __builtin_offsetof(t, d)
                       ^
37 warnings and 2 errors generated.
make[2]: *** [common/test/CMakeFiles/test_operators.dir/test_operators.cpp.o] Error 1
make[1]: *** [common/test/CMakeFiles/test_operators.dir/all] Error 2
37 warnings generated.
Linking CXX executable test_wrappers
clang: warning: unknown warning option '-Wl'
37 warnings generated.
Linking CXX executable test_plane_intersection
[ 10%] Built target test_wrappers
clang: warning: unknown warning option '-Wl'
[ 10%] Built target test_plane_intersection
37 warnings generated.
Linking CXX executable test_pca
clang: warning: unknown warning option '-Wl'
[ 10%] Built target test_pca
make: *** [all] Error 2

<== Failed to process package 'pcl': 
  Command '/Users/alex/ros_catkin_ws/install_isolated/env.sh make -j8 -l8' returned non-zero exit status 2

Reproduce this error by running:
==> /Users/alex/ros_catkin_ws/install_isolated/env.sh make -j8 -l8

Command failed, exiting.

This seems to be a regression bug of some sort, judging by the fact that many people have had similar error messages before, though seemingly for different reasons (I checked the pcl_find_ros.cmake file and it looks up-to-date, since this seemed to be the culprit previously).

Any ideas here, folks?

Failed to process package 'pcl'

Note: links are disguised since the forum won't let me post them. Please recover them accordingly.

I get the following errors when executing ./src/catkin/bin/catkin_make_isolated --install as suggested by the build instructions for OS X (v10.8.2) (see here>.).

The end of my shell log looks like:

/Users/alex/ros_catkin_ws/src/pcl/common/include/pcl/ros/register_point_struct.h:93:29: note: expanded from macro 'POINT_CLOUD_REGISTER_POINT_STRUCT_I'
      BOOST_PP_SEQ_FOR_EACH(POINT_CLOUD_REGISTER_FIELD_OFFSET, name, seq)        \
                            ^
/usr/local/include/boost/preprocessor/seq/for_each.hpp:26:67: note: expanded from macro 'BOOST_PP_SEQ_FOR_EACH'
#    define BOOST_PP_SEQ_FOR_EACH(macro, data, seq) BOOST_PP_FOR((macro, data, seq (nil)), BOOST_PP_SEQ_FOR_EACH_P, BOOST_PP_SEQ_FOR_EACH_O, BOOST_PP_SEQ_FOR_EACH_M)
                                                                  ^
note: (skipping 41 expansions in backtrace; use -fmacro-backtrace-limit=0 to see all)
/usr/local/include/boost/preprocessor/seq/for_each.hpp:49:57: note: expanded from macro 'BOOST_PP_SEQ_FOR_EACH_M_I'
# define BOOST_PP_SEQ_FOR_EACH_M_I(r, macro, data, seq) macro(r, data, BOOST_PP_SEQ_HEAD(seq))
                                                        ^
/Users/alex/ros_catkin_ws/src/pcl/common/include/pcl/ros/register_point_struct.h:121:33: note: expanded from macro 'POINT_CLOUD_REGISTER_FIELD_OFFSET'
    static const size_t value = offsetof(name, BOOST_PP_TUPLE_ELEM(3, 1, elem)); \
                                ^
/usr/bin/../lib/clang/4.2/include/stddef.h:62:24: note: expanded from macro 'offsetof'
#define offsetof(t, d) __builtin_offsetof(t, d)
                       ^
37 warnings and 2 errors generated.
make[2]: *** [common/test/CMakeFiles/test_operators.dir/test_operators.cpp.o] Error 1
make[1]: *** [common/test/CMakeFiles/test_operators.dir/all] Error 2
37 warnings generated.
Linking CXX executable test_wrappers
clang: warning: unknown warning option '-Wl'
37 warnings generated.
Linking CXX executable test_plane_intersection
[ 10%] Built target test_wrappers
clang: warning: unknown warning option '-Wl'
[ 10%] Built target test_plane_intersection
37 warnings generated.
Linking CXX executable test_pca
clang: warning: unknown warning option '-Wl'
[ 10%] Built target test_pca
make: *** [all] Error 2

<== Failed to process package 'pcl': 
  Command '/Users/alex/ros_catkin_ws/install_isolated/env.sh make -j8 -l8' returned non-zero exit status 2

Reproduce this error by running:
==> /Users/alex/ros_catkin_ws/install_isolated/env.sh make -j8 -l8

Command failed, exiting.

This seems to be a regression bug of some sort, judging by the fact that many people have had similar error messages before, though seemingly for different reasons (I checked the pcl_find_ros.cmake file and it looks up-to-date, since this seemed to be the culprit previously).

Any ideas here, folks?

Failed to process package 'pcl'

Note: links are disguised since the forum won't let me post them. Please recover them accordingly.

I get the following errors when executing ./src/catkin/bin/catkin_make_isolated --install as suggested by the build instructions for OS X (v10.8.2) (see here).

The end of You can view my complete shell log looks like:for the installation command here.

/Users/alex/ros_catkin_ws/src/pcl/common/include/pcl/ros/register_point_struct.h:93:29: note: expanded from macro 'POINT_CLOUD_REGISTER_POINT_STRUCT_I'
      BOOST_PP_SEQ_FOR_EACH(POINT_CLOUD_REGISTER_FIELD_OFFSET, name, seq)        \
                            ^
/usr/local/include/boost/preprocessor/seq/for_each.hpp:26:67: note: expanded from macro 'BOOST_PP_SEQ_FOR_EACH'
#    define BOOST_PP_SEQ_FOR_EACH(macro, data, seq) BOOST_PP_FOR((macro, data, seq (nil)), BOOST_PP_SEQ_FOR_EACH_P, BOOST_PP_SEQ_FOR_EACH_O, BOOST_PP_SEQ_FOR_EACH_M)
                                                                  ^
note: (skipping 41 expansions in backtrace; use -fmacro-backtrace-limit=0 to see all)
/usr/local/include/boost/preprocessor/seq/for_each.hpp:49:57: note: expanded from macro 'BOOST_PP_SEQ_FOR_EACH_M_I'
# define BOOST_PP_SEQ_FOR_EACH_M_I(r, macro, data, seq) macro(r, data, BOOST_PP_SEQ_HEAD(seq))
                                                        ^
/Users/alex/ros_catkin_ws/src/pcl/common/include/pcl/ros/register_point_struct.h:121:33: note: expanded from macro 'POINT_CLOUD_REGISTER_FIELD_OFFSET'
    static const size_t value = offsetof(name, BOOST_PP_TUPLE_ELEM(3, 1, elem)); \
                                ^
/usr/bin/../lib/clang/4.2/include/stddef.h:62:24: note: expanded from macro 'offsetof'
#define offsetof(t, d) __builtin_offsetof(t, d)
                       ^
37 warnings and 2 errors generated.
make[2]: *** [common/test/CMakeFiles/test_operators.dir/test_operators.cpp.o] Error 1
make[1]: *** [common/test/CMakeFiles/test_operators.dir/all] Error 2
37 warnings generated.
Linking CXX executable test_wrappers
clang: warning: unknown warning option '-Wl'
37 warnings generated.
Linking CXX executable test_plane_intersection
[ 10%] Built target test_wrappers
clang: warning: unknown warning option '-Wl'
[ 10%] Built target test_plane_intersection
37 warnings generated.
Linking CXX executable test_pca
clang: warning: unknown warning option '-Wl'
[ 10%] Built target test_pca
make: *** [all] Error 2

<== Failed to process package 'pcl': 
  Command '/Users/alex/ros_catkin_ws/install_isolated/env.sh make -j8 -l8' returned non-zero exit status 2

Reproduce this error by running:
==> /Users/alex/ros_catkin_ws/install_isolated/env.sh make -j8 -l8

Command failed, exiting.

This seems to be a regression bug of some sort, judging by the fact that many people have had similar error messages before, though seemingly for different reasons (I checked the pcl_find_ros.cmake file and it looks up-to-date, since this seemed to be the culprit previously).

Any ideas here, folks?