Ask Your Question

Revision history [back]

click to hide/show revision 1
initial version

Issue installing turtlebot3 simulation on ubuntu 16.04

I switched from ubuntu 14.04 to ubuntu 16.04 and try to completely remove ros indigo and install ros kinetic and gazebo9 I followed a guide to install . This is a lists of my command on terminal:

cd ~/catkin_ws/src

1) git clone https://github.com/ROBOTIS-GIT/turtlebot3_simulations.git

2) git clone https://github.com/ROBOTIS-GIT/turtlebot3_msgs.git

3) git clone https://github.com/ROBOTIS-GIT/turtlebot3.git

4) cd ~/catkin_ws && catkin_make && source ~/catkin_ws/devel/setup.bash

cd ..

catkin_make

This is the last part of output

Scanning dependencies of target turtlebot3_fake_node [ 70%] Built target turtlebot3_example_generate_messages_cpp [ 80%] Built target turtlebot3_example_generate_messages_eus [ 89%] Built target turtlebot3_example_generate_messages_lisp make[2]: * No rule to make target '/usr/lib/liblog4cxx.so', needed by '/home/me/catkin_ws/devel/lib/turtlebot3_gazebo/turtlebot3_drive'. Stop. CMakeFiles/Makefile2:4337: recipe for target 'turtlebot3_simulations/turtlebot3_gazebo/CMakeFiles/turtlebot3_drive.dir/all' failed make[1]: [turtlebot3_simulations/turtlebot3_gazebo/CMakeFiles/turtlebot3_drive.dir/all] Error 2 make[1]: Waiting for unfinished jobs.... make[2]: No rule to make target '/usr/lib/liblog4cxx.so', needed by '/home/me/catkin_ws/devel/lib/turtlebot3_bringup/turtlebot3_diagnostics'. Stop. CMakeFiles/Makefile2:1680: recipe for target 'turtlebot3/turtlebot3_bringup/CMakeFiles/turtlebot3_diagnostics.dir/all' failed make[1]: [turtlebot3/turtlebot3_bringup/CMakeFiles/turtlebot3_diagnostics.dir/all] Error 2 [ 89%] Built target turtlebot3_msgs_generate_messages make[2]: No rule to make target '/usr/lib/liblog4cxx.so', needed by '/home/me/catkin_ws/devel/lib/turtlebot3_fake/turtlebot3_fake_node'. Stop. make[2]: Waiting for unfinished jobs.... [ 91%] Building CXX object turtlebot3_simulations/turtlebot3_fake/CMakeFiles/turtlebot3_fake_node.dir/src/turtlebot3_fake.cpp.o CMakeFiles/Makefile2:3683: recipe for target 'turtlebot3_simulations/turtlebot3_fake/CMakeFiles/turtlebot3_fake_node.dir/all' failed make[1]: [turtlebot3_simulations/turtlebot3_fake/CMakeFiles/turtlebot3_fake_node.dir/all] Error 2 Makefile:138: recipe for target 'all' failed make: ** [all] Error 2 Invoking "make -j4 -l4" failed

Suggestions? I'm a newbie on ROS

Issue installing turtlebot3 simulation on ubuntu 16.04

I switched from ubuntu 14.04 to ubuntu 16.04 and try to completely remove ros indigo and install ros kinetic and gazebo9 I followed a guide to install . This is a lists of my command on terminal:

cd ~/catkin_ws/src

1) git clone https://github.com/ROBOTIS-GIT/turtlebot3_simulations.git

2) git clone https://github.com/ROBOTIS-GIT/turtlebot3_msgs.git

3) git clone https://github.com/ROBOTIS-GIT/turtlebot3.git

4) cd ~/catkin_ws && catkin_make && source ~/catkin_ws/devel/setup.bash

cd ..

catkin_make

This is the last part of output

Scanning dependencies of target turtlebot3_fake_node
[ 70%] Built target turtlebot3_example_generate_messages_cpp
[ 80%] Built target turtlebot3_example_generate_messages_eus
[ 89%] Built target turtlebot3_example_generate_messages_lisp
make[2]: * *** No rule to make target '/usr/lib/liblog4cxx.so', needed by '/home/me/catkin_ws/devel/lib/turtlebot3_gazebo/turtlebot3_drive'.  Stop.
CMakeFiles/Makefile2:4337: recipe for target 'turtlebot3_simulations/turtlebot3_gazebo/CMakeFiles/turtlebot3_drive.dir/all' failed
make[1]:  *** [turtlebot3_simulations/turtlebot3_gazebo/CMakeFiles/turtlebot3_drive.dir/all] Error 2
make[1]:  *** Waiting for unfinished jobs....
make[2]:  *** No rule to make target '/usr/lib/liblog4cxx.so', needed by '/home/me/catkin_ws/devel/lib/turtlebot3_bringup/turtlebot3_diagnostics'.  Stop.
CMakeFiles/Makefile2:1680: recipe for target 'turtlebot3/turtlebot3_bringup/CMakeFiles/turtlebot3_diagnostics.dir/all' failed
make[1]:  *** [turtlebot3/turtlebot3_bringup/CMakeFiles/turtlebot3_diagnostics.dir/all] Error 2
[ 89%] Built target turtlebot3_msgs_generate_messages
make[2]:  *** No rule to make target '/usr/lib/liblog4cxx.so', needed by '/home/me/catkin_ws/devel/lib/turtlebot3_fake/turtlebot3_fake_node'.  Stop.
make[2]:  *** Waiting for unfinished jobs....
[ 91%] Building CXX object turtlebot3_simulations/turtlebot3_fake/CMakeFiles/turtlebot3_fake_node.dir/src/turtlebot3_fake.cpp.o
CMakeFiles/Makefile2:3683: recipe for target 'turtlebot3_simulations/turtlebot3_fake/CMakeFiles/turtlebot3_fake_node.dir/all' failed
make[1]:  *** [turtlebot3_simulations/turtlebot3_fake/CMakeFiles/turtlebot3_fake_node.dir/all] Error 2
Makefile:138: recipe for target 'all' failed
make: ** *** [all] Error 2
Invoking "make -j4 -l4" failed

failed

Suggestions? I'm a newbie on ROS