Invoking "make -j4 -l4" failed [closed]

asked 2018-10-18 08:57:30 -0600

yangs11 gravatar image

updated 2018-10-18 09:06:22 -0600

Errors after calling catkin_make

make[1]: *** Waiting for unfinished jobs....
/usr/bin/ld: cannot find -lQt5::Core
/usr/bin/ld: cannot find -lQt5::Gui
/usr/bin/ld: cannot find -lQt5::Widgets
/usr/bin/ld: cannot find -lQt5::Test
/usr/bin/ld: cannot find -lQt5::Concurrent
/usr/bin/ld: cannot find -lQt5::OpenGL
collect2: error: ld returned 1 exit status
Guidance-SDK-ROS/CMakeFiles/guidanceNodeCalibration.dir/build.make:169: recipe for target '/home/missionbox/catkin_ws/devel/lib/guidance/guidanceNodeCalibration' failed
make[2]: *** [/home/missionbox/catkin_ws/devel/lib/guidance/guidanceNodeCalibration] Error 1
CMakeFiles/Makefile2:459: recipe for target 'Guidance-SDK-ROS/CMakeFiles/guidanceNodeCalibration.dir/all' failed
make[1]: *** [Guidance-SDK-ROS/CMakeFiles/guidanceNodeCalibration.dir/all] Error 2
Makefile:140: recipe for target 'all' failed
make: *** [all] Error 2
Invoking "make -j4 -l4" failed
edit retag flag offensive reopen merge delete

Closed for the following reason Question does not follow our guidelines for questions. Please see: http://wiki.ros.org/Support for more details. by jarvisschultz
close date 2018-10-23 07:50:05.311948

Comments

Would be useful to provide a link to the packages that you are trying to build. If we can't see the package.xml and the CMakeLists.txt it is much more difficult to debug a situation like this.

jarvisschultz gravatar imagejarvisschultz ( 2018-10-18 09:08:43 -0600 )edit

I would almost go further and close this as the post does not adhere to the support guidelines.

gvdhoorn gravatar imagegvdhoorn ( 2018-10-18 10:03:24 -0600 )edit

That is very true. @yangs11 if you do not update your question and provide more detail as described in the support guidelines, we will close this question.

jarvisschultz gravatar imagejarvisschultz ( 2018-10-19 11:27:13 -0600 )edit