[OSX Indigo] No rule to make target `/usr/local/lib/libpangoxft-1.0.dylib [closed]

asked 2015-08-11 15:52:33 -0600

130s gravatar image

Using @Mike Purvis' handy install script, I'm stuck at building image_view. Anybody has a luck in solving this?

I updated glfw by brew reinstall glfw in trying to mimic this non-ROS discussion but no good.

OSX 10.10.4

[image_view] ==> '/Users/n130s/indigo_desktop_full_ws/build/image_view/build_env.sh /usr/bin/make --jobserver-fds=3,4 -j' in '/Users/n130s/indigo_desktop_full_ws/build/image_view'
Scanning dependencies of target disparity_view
Scanning dependencies of target extract_images
Scanning dependencies of target image_saver
[  6%] Building CXX object CMakeFiles/disparity_view.dir/src/nodes/disparity_view.cpp.o
[ 12%] Building CXX object CMakeFiles/extract_images.dir/src/nodes/extract_images.cpp.o
[ 18%] Building CXX object CMakeFiles/image_saver.dir/src/nodes/image_saver.cpp.o
Scanning dependencies of target image_view
Scanning dependencies of target image_view_exe
[ 25%] Building CXX object CMakeFiles/image_view_exe.dir/src/nodes/image_view.cpp.o
Scanning dependencies of target stereo_view
[ 31%] Linking CXX executable /Users/n130s/indigo_desktop_full_ws/devel/lib/image_view/disparity_view
[ 37%] Building CXX object CMakeFiles/image_view.dir/src/nodelets/image_nodelet.cpp.o
[ 37%] Built target disparity_view
[ 43%] Building CXX object CMakeFiles/image_view.dir/src/nodelets/disparity_nodelet.cpp.o
Scanning dependencies of target video_recorder
make[2]: *** No rule to make target `/usr/local/lib/libpangoxft-1.0.dylib', needed by `/Users/n130s/indigo_desktop_full_ws/devel/lib/image_view/stereo_view'.  Stop.
make[2]: *** Waiting for unfinished jobs....
[ 50%] Building CXX object CMakeFiles/stereo_view.dir/src/nodes/stereo_view.cpp.o
[ 56%] Building CXX object CMakeFiles/video_recorder.dir/src/nodes/video_recorder.cpp.o
[ 62%] Linking CXX executable /Users/n130s/indigo_desktop_full_ws/devel/lib/image_view/image_saver
[ 62%] Built target image_saver
make[2]: *** No rule to make target `/usr/local/lib/libpangoxft-1.0.dylib', needed by `/Users/n130s/indigo_desktop_full_ws/devel/lib/libimage_view.dylib'.  Stop.
make[2]: *** Waiting for unfinished jobs....
[ 68%] Building CXX object CMakeFiles/image_view.dir/src/nodelets/window_thread.cpp.o
[ 75%] Linking CXX executable /Users/n130s/indigo_desktop_full_ws/devel/lib/image_view/extract_images
[ 75%] Built target extract_images
[ 81%] Linking CXX executable /Users/n130s/indigo_desktop_full_ws/devel/lib/image_view/image_view
[ 81%] Built target image_view_exe
[ 87%] Linking CXX executable /Users/n130s/indigo_desktop_full_ws/devel/lib/image_view/video_recorder
[ 87%] Built target video_recorder
make[1]: *** [CMakeFiles/image_view.dir/all] Error 2
make[1]: *** Waiting for unfinished jobs....
make[1]: *** [CMakeFiles/stereo_view.dir/all] Error 2
make: *** [all] Error 2
[image_view] <== '/Users/n130s/indigo_desktop_full_ws/build/image_view/build_env.sh /usr/bin/make --jobserver-fds=3,4 -j' failed with return code '2'

Failed   <== image_view                       [ 25.1 seconds ]                                                    
Finished <== actionlib                        [ 15.9 seconds ]                                                    
Finished <== image_proc                       [ 16.0 seconds ]                                                    
[build] There were '1' errors:                                                                                    

Failed to build package 'image_view' because the following command:

# Command to reproduce:
cd /Users/n130s/indigo_desktop_full_ws/build/image_view && /Users/n130s/indigo_desktop_full_ws/build/image_view/build_env.sh /usr/bin/make --jobserver-fds=3,4 -j; cd -

# Path to log:
cat /Users/n130s/indigo_desktop_full_ws/build/build_logs/image_view.log

Exited with return code: 2 

[build] Runtime: 3 minutes and 23.1 seconds
edit retag flag offensive reopen merge delete

Closed for the following reason question is not relevant or outdated by 130s
close date 2016-05-26 15:12:17.164550