g2o error on running samples

asked 2014-04-12 07:27:22 -0500

cvusermbaxkms7 gravatar image

updated 2014-04-12 07:35:25 -0500

I am getting the following error on running g2o on linux. What could be the reason? Any help will be appreciated

[  3%] Building CXX object data_fitting/CMakeFiles/circle_fit.dir/circle_fit.o /g2o/trunk/g2o/examples/data_fitting/circle_fit.cpp:27:22: fatal error: Eigen/Core: No such file or directory compilation terminated.
make[2]: *** [data_fitting/CMakeFiles/circle_fit.dir/circle_fit.o] Error 1
make[1]: *** [data_fitting/CMakeFiles/circle_fit.dir/all] Error 2
make: *** [all] Error 2
edit retag flag offensive close merge delete

Comments

try installing Eigen library

sai gravatar imagesai ( 2014-04-15 19:21:22 -0500 )edit