Ask Your Question

Revision history [back]

click to hide/show revision 1
initial version

Any clues here?

I have the compressed_vis, and did the previous steps.

15:28:38.806 [QUIET] [system.out] Buildfile: /home/phil/my_workspace/android_core/android_gingerbread_mr1/build.xml
15:28:39.555 [QUIET] [system.out] 
15:28:39.555 [QUIET] [system.out] -set-mode-check:
15:28:39.555 [QUIET] [system.out] 
15:28:39.556 [QUIET] [system.out] -set-debug-files:
15:28:39.556 [QUIET] [system.out] 
15:28:39.556 [QUIET] [system.out] -set-debug-mode:
15:28:39.557 [QUIET] [system.out] 
15:28:39.557 [QUIET] [system.out] -debug-obfuscation-check:
15:28:39.558 [QUIET] [system.out] 
15:28:39.558 [QUIET] [system.out] -setup:
15:28:39.570 [QUIET] [system.out]      [echo] Creating output directories if needed...
15:28:39.573 [QUIET] [system.out]      [echo] Gathering info for android_gingerbread_mr1...
15:28:39.578 [QUIET] [system.out]     [setup] Android SDK Tools Revision 19
15:28:39.647 [QUIET] [system.out]     [setup] Project Target: Android 2.3.3
15:28:39.648 [QUIET] [system.out]     [setup] API level: 10
15:28:39.648 [QUIET] [system.out]     [setup] Project Type: Android Library
15:28:39.650 [QUIET] [system.out]     [setup] 
15:28:39.651 [QUIET] [system.out]     [setup] ------------------
15:28:39.651 [QUIET] [system.out]     [setup] Resolving library dependencies:
15:28:39.653 [QUIET] [system.out]     [setup] No library dependencies.
15:28:39.653 [QUIET] [system.out]     [setup] 
15:28:39.654 [QUIET] [system.out]     [setup] ------------------
15:28:39.654 [QUIET] [system.out]     [setup] API<=15: Adding annotations.jar to the classpath.
15:28:39.655 [QUIET] [system.out]     [setup] 
15:28:39.655 [QUIET] [system.out]     [setup] ------------------
15:28:39.759 [QUIET] [system.out] 
15:28:39.759 [QUIET] [system.out] -build-setup:
15:28:39.775 [QUIET] [system.out] 
15:28:39.777 [QUIET] [system.out] -pre-build:
15:28:39.780 [QUIET] [system.out] 
15:28:39.780 [QUIET] [system.out] -code-gen:
15:28:39.783 [QUIET] [system.out]      [echo] ----------
15:28:39.783 [QUIET] [system.out]      [echo] Handling aidl files...
15:28:39.808 [QUIET] [system.out]      [aidl] No AIDL files to compile.
15:28:39.809 [QUIET] [system.out]      [echo] ----------
15:28:39.810 [QUIET] [system.out]      [echo] Handling RenderScript files...
15:28:39.835 [QUIET] [system.out] [renderscript] No RenderScript files to compile.
15:28:39.836 [QUIET] [system.out]      [echo] ----------
15:28:39.836 [QUIET] [system.out]      [echo] Handling Resources...
15:28:39.849 [QUIET] [system.out]      [aapt] No changed resources. R.java and Manifest.java untouched.
15:28:39.849 [QUIET] [system.out]      [echo] ----------
15:28:39.850 [QUIET] [system.out]      [echo] Handling BuildConfig class...
15:28:39.865 [QUIET] [system.out] [buildconfig] No need to generate new BuildConfig.
15:28:39.868 [QUIET] [system.out] 
15:28:39.868 [QUIET] [system.out] -pre-compile:
15:28:39.870 [QUIET] [system.out] 
15:28:39.870 [QUIET] [system.out] -compile:
15:28:39.911 [QUIET] [system.out]      [echo] Creating library output jar file...
15:28:39.970 [QUIET] [system.out] 
15:28:39.970 [QUIET] [system.out] -post-compile:
15:28:39.970 [QUIET] [system.out] 
15:28:39.971 [QUIET] [system.out] -obfuscate:
15:28:39.971 [QUIET] [system.out] 
15:28:39.971 [QUIET] [system.out] -dex:
15:28:39.973 [QUIET] [system.out]      [echo] Library project: do not convert bytecode...
15:28:39.974 [QUIET] [system.out] 
15:28:39.974 [QUIET] [system.out] -crunch:
15:28:40.100 [QUIET] [system.out]    [crunch] Crunching PNG Files in source dir: /home/phil/my_workspace/android_core/android_gingerbread_mr1/res
15:28:40.100 [QUIET] [system.out]    [crunch] To destination dir: /home/phil/my_workspace/android_core/android_gingerbread_mr1/bin/res
15:28:40.100 [QUIET] [system.out]    [crunch] Crunched 0 PNG files to update cache
15:28:40.401 [QUIET] [system.out] 
15:28:40.402 [QUIET] [system.out] -package-resources:
15:28:40.404 [QUIET] [system.out]      [echo] Library project: do not package resources...
15:28:40.405 [QUIET] [system.out] 
15:28:40.405 [QUIET] [system.out] -package:
15:28:40.412 [QUIET] [system.out]      [echo] Library project: do not package apk...
15:28:40.412 [QUIET] [system.out] 
15:28:40.413 [QUIET] [system.out] -post-package:
15:28:40.413 [QUIET] [system.out] 
15:28:40.413 [QUIET] [system.out] -do-debug:
15:28:40.413 [QUIET] [system.out]      [echo] Library project: do not create apk...
15:28:40.419 [QUIET] [system.out] [propertyfile] Updating property file: /home/phil/my_workspace/android_core/android_gingerbread_mr1/bin/build.prop
15:28:40.433 [QUIET] [system.out] [propertyfile] Updating property file: /home/phil/my_workspace/android_core/android_gingerbread_mr1/bin/build.prop
15:28:40.443 [QUIET] [system.out] [propertyfile] Updating property file: /home/phil/my_workspace/android_core/android_gingerbread_mr1/bin/build.prop
15:28:40.445 [QUIET] [system.out] [propertyfile] Updating property file: /home/phil/my_workspace/android_core/android_gingerbread_mr1/bin/build.prop
15:28:40.448 [QUIET] [system.out] 
15:28:40.448 [QUIET] [system.out] -post-build:
15:28:40.448 [QUIET] [system.out] 
15:28:40.448 [QUIET] [system.out] debug:
15:28:40.449 [QUIET] [system.out] 
15:28:40.449 [QUIET] [system.out] BUILD SUCCESSFUL
15:28:40.449 [QUIET] [system.out] Total time: 1 second
15:28:40.460 [DEBUG] [org.gradle.process.internal.DefaultExecHandle] Process finished (code: 0) for command 'ant'.
15:28:40.460 [DEBUG] [org.gradle.logging.internal.DefaultLoggingConfigurer] Finished configuring with level: DEBUG, configurers: [org.gradle.logging.internal.OutputEventRenderer@2bd1e730, org.gradle.logging.internal.slf4j.Slf4jLoggingConfigurer@61a116c9, org.gradle.logging.internal.JavaUtilLoggingConfigurer@16df1832]
15:28:40.461 [DEBUG] [org.gradle.api.internal.tasks.execution.ExecuteAtMostOnceTaskExecuter] Finished executing task ':android_gingerbread_mr1:debug'
15:28:40.462 [LIFECYCLE] [org.gradle.TaskExecutionLogger] :android_honeycomb_mr2:deployLibs
15:28:40.462 [DEBUG] [org.gradle.api.internal.tasks.execution.ExecuteAtMostOnceTaskExecuter] Starting to execute task ':android_honeycomb_mr2:deployLibs'
15:28:40.464 [DEBUG] [org.gradle.api.internal.artifacts.ivyservice.resolveengine.DefaultDependencyResolver] Resolving configuration ':android_honeycomb_mr2:compile'
15:28:40.471 [DEBUG] [org.gradle.api.internal.artifacts.ivyservice.resolveengine.DependencyGraphBuilder] Visiting configuration ros.android_core#android_honeycomb_mr2;0.0.0-SNAPSHOT(compile).
15:28:40.471 [DEBUG] [org.gradle.api.internal.artifacts.ivyservice.resolveengine.DependencyGraphBuilder] Visiting dependency ros.android_core#android_honeycomb_mr2;0.0.0-SNAPSHOT(compile) -> ros.rosjava_core#rosjava_geometry;0.0.0-SNAPSHOT([default])
15:28:40.472 [DEBUG] [org.gradle.api.internal.artifacts.ivyservice.resolveengine.DependencyGraphBuilder] Selecting new module version ros.rosjava_core#rosjava_geometry;0.0.0-SNAPSHOT
15:28:40.473 [DEBUG] [org.gradle.api.internal.artifacts.ivyservice.IvyLoggingAdaper] MavenLocal: no namespace defined: using system
15:28:40.473 [DEBUG] [org.gradle.api.internal.artifacts.repositories.MavenResolver] maven-metadata not available: /home/phil/.m2/repository/ros/rosjava_core/rosjava_geometry/0.0.0-SNAPSHOT/maven-metadata.xml
15:28:40.474 [DEBUG] [org.gradle.api.internal.artifacts.ivyservice.IvyLoggingAdaper]    tried /home/phil/.m2/repository/ros/rosjava_core/rosjava_geometry/0.0.0-SNAPSHOT/rosjava_geometry-0.0.0-SNAPSHOT.pom
15:28:40.475 [DEBUG] [org.gradle.api.internal.artifacts.repositories.ResourceCollectionResolver] Loading /home/phil/.m2/repository/ros/rosjava_core/rosjava_geometry/0.0.0-SNAPSHOT/rosjava_geometry-0.0.0-SNAPSHOT.pom
15:28:40.475 [DEBUG] [org.gradle.api.internal.artifacts.ivyservice.IvyLoggingAdaper]  MavenLocal: found md file for ros.rosjava_core#rosjava_geometry;0.0.0-SNAPSHOT
15:28:40.476 [DEBUG] [org.gradle.api.internal.artifacts.ivyservice.IvyLoggingAdaper]    => /home/phil/.m2/repository/ros/rosjava_core/rosjava_geometry/0.0.0-SNAPSHOT/rosjava_geometry-0.0.0-SNAPSHOT.pom (0.0.0-SNAPSHOT)
15:28:40.477 [DEBUG] [org.gradle.api.internal.artifacts.ivyservice.IvyLoggingAdaper]  parser = pom parser
15:28:40.480 [DEBUG] [org.gradle.api.internal.artifacts.ivyservice.IvyLoggingAdaper]  checking ros.rosjava_core#rosjava_geometry;0.0.0-SNAPSHOT from MavenLocal against [none]
15:28:40.481 [DEBUG] [org.gradle.api.internal.artifacts.ivyservice.IvyLoggingAdaper]  module revision kept as first found: ros.rosjava_core#rosjava_geometry;0.0.0-SNAPSHOT from MavenLocal
15:28:40.482 [DEBUG] [org.gradle.api.internal.artifacts.ivyservice.ivyresolve.UserResolverChain] Found module ros.rosjava_core#rosjava_geometry;0.0.0-SNAPSHOT using repository MavenLocal
15:28:40.483 [DEBUG] [org.gradle.api.internal.artifacts.ivyservice.resolveengine.DependencyGraphBuilder] Visiting configuration ros.rosjava_core#rosjava_geometry;0.0.0-SNAPSHOT(default).
15:28:40.484 [DEBUG] [org.gradle.api.internal.artifacts.ivyservice.resolveengine.DependencyGraphBuilder] Visiting dependency ros.rosjava_core#rosjava_geometry;0.0.0-SNAPSHOT(default) -> ros.rosjava_core#rosjava;0.0.0-SNAPSHOT([compile(*), master(*), runtime(*)])
15:28:40.484 [DEBUG] [org.gradle.api.internal.artifacts.ivyservice.resolveengine.DependencyGraphBuilder] Selecting new module version ros.rosjava_core#rosjava;0.0.0-SNAPSHOT
15:28:40.485 [DEBUG] [org.gradle.api.internal.artifacts.repositories.MavenResolver] maven-metadata not available: /home/phil/.m2/repository/ros/rosjava_core/rosjava/0.0.0-SNAPSHOT/maven-metadata.xml
15:28:40.486 [DEBUG] [org.gradle.api.internal.artifacts.ivyservice.IvyLoggingAdaper]    tried /home/phil/.m2/repository/ros/rosjava_core/rosjava/0.0.0-SNAPSHOT/rosjava-0.0.0-SNAPSHOT.pom
15:28:40.492 [DEBUG] [org.gradle.api.internal.artifacts.repositories.ResourceCollectionResolver] Loading /home/phil/.m2/repository/ros/rosjava_core/rosjava/0.0.0-SNAPSHOT/rosjava-0.0.0-SNAPSHOT.pom
15:28:40.493 [DEBUG] [org.gradle.api.internal.artifacts.ivyservice.IvyLoggingAdaper]  MavenLocal: found md file for ros.rosjava_core#rosjava;0.0.0-SNAPSHOT
15:28:40.493 [DEBUG] [org.gradle.api.internal.artifacts.ivyservice.IvyLoggingAdaper]    => /home/phil/.m2/repository/ros/rosjava_core/rosjava/0.0.0-SNAPSHOT/rosjava-0.0.0-SNAPSHOT.pom (0.0.0-SNAPSHOT)
15:28:40.494 [DEBUG] [org.gradle.api.internal.artifacts.ivyservice.IvyLoggingAdaper]  parser = pom parser
15:28:40.497 [DEBUG] [org.gradle.api.internal.artifacts.ivyservice.IvyLoggingAdaper]  checking ros.rosjava_core#rosjava;0.0.0-SNAPSHOT from MavenLocal against [none]
15:28:40.497 [DEBUG] [org.gradle.api.internal.artifacts.ivyservice.IvyLoggingAdaper]  module revision kept as first found: ros.rosjava_core#rosjava;0.0.0-SNAPSHOT from MavenLocal
15:28:40.497 [DEBUG] [org.gradle.api.internal.artifacts.ivyservice.ivyresolve.UserResolverChain] Found module ros.rosjava_core#rosjava;0.0.0-SNAPSHOT using repository MavenLocal
15:28:40.498 [DEBUG] [org.gradle.api.internal.artifacts.ivyservice.resolveengine.DependencyGraphBuilder] Visiting configuration ros.rosjava_core#rosjava;0.0.0-SNAPSHOT(compile).
15:28:40.498 [DEBUG] [org.gradle.api.internal.artifacts.ivyservice.resolveengine.DependencyGraphBuilder] Visiting dependency ros.rosjava_core#rosjava;0.0.0-SNAPSHOT(compile) -> org.jboss.netty#netty;3.2.4.Final([compile(*), master(*)])
15:28:40.498 [DEBUG] [org.gradle.api.internal.artifacts.ivyservice.resolveengine.DependencyGraphBuilder] Selecting new module version org.jboss.netty#netty;3.2.4.Final
15:28:40.499 [DEBUG] [org.gradle.api.internal.artifacts.ivyservice.IvyLoggingAdaper]    tried /home/phil/.m2/repository/org/jboss/netty/netty/3.2.4.Final/netty-3.2.4.Final.pom
15:28:40.499 [DEBUG] [org.gradle.api.internal.artifacts.repositories.ResourceCollectionResolver] Loading /home/phil/.m2/repository/org/jboss/netty/netty/3.2.4.Final/netty-3.2.4.Final.pom
15:28:40.500 [DEBUG] [org.gradle.api.internal.artifacts.repositories.ResourceCollectionResolver] Resource not reachable for org/jboss/netty#netty;3.2.4.Final: res=/home/phil/.m2/repository/org/jboss/netty/netty/3.2.4.Final/netty-3.2.4.Final.pom
15:28:40.500 [DEBUG] [org.gradle.api.internal.artifacts.ivyservice.IvyLoggingAdaper]    tried /home/phil/.m2/repository/org/jboss/netty/netty/3.2.4.Final/netty-3.2.4.Final.jar
15:28:40.500 [DEBUG] [org.gradle.api.internal.artifacts.repositories.ResourceCollectionResolver] Loading /home/phil/.m2/repository/org/jboss/netty/netty/3.2.4.Final/netty-3.2.4.Final.jar
15:28:40.501 [DEBUG] [org.gradle.api.internal.artifacts.repositories.ResourceCollectionResolver] Resource not reachable for org/jboss/netty#netty;3.2.4.Final: res=/home/phil/.m2/repository/org/jboss/netty/netty/3.2.4.Final/netty-3.2.4.Final.jar
15:28:40.501 [DEBUG] [org.gradle.api.internal.artifacts.ivyservice.IvyLoggingAdaper]  MavenLocal: no ivy file nor artifact found for org.jboss.netty#netty;3.2.4.Final
15:28:40.502 [DEBUG] [org.gradle.cache.internal.DefaultFileLockManager] Waiting to acquire exclusive lock on artifact cache (/home/phil/.gradle/caches/artifacts-8).
15:28:40.502 [DEBUG] [org.gradle.cache.internal.DefaultFileLockManager] Lock acquired.
15:28:40.503 [DEBUG] [org.gradle.cache.internal.btree.BTreePersistentIndexedCache] Opening cache dynamic-revisions.bin (/home/phil/.gradle/caches/artifacts-8/dynamic-revisions.bin)
15:28:40.503 [DEBUG] [org.gradle.cache.internal.btree.BTreePersistentIndexedCache] Opening cache module-metadata.bin (/home/phil/.gradle/caches/artifacts-8/module-metadata.bin)
15:28:40.505 [DEBUG] [org.gradle.api.internal.artifacts.ivyservice.IvyLoggingAdaper] post 1.3 ivy file: using exact as default matcher
15:28:40.506 [DEBUG] [org.gradle.api.internal.artifacts.ivyservice.ivyresolve.CachingModuleVersionRepository] Using cached module metadata for 'org.jboss.netty#netty;3.2.4.Final'
15:28:40.506 [DEBUG] [org.gradle.api.internal.artifacts.ivyservice.ivyresolve.UserResolverChain] Found module org.jboss.netty#netty;3.2.4.Final using repository maven
15:28:40.507 [DEBUG] [org.gradle.api.internal.artifacts.ivyservice.resolveengine.DependencyGraphBuilder] Visiting dependency ros.rosjava_core#rosjava;0.0.0-SNAPSHOT(compile) -> com.google.guava#guava;r07([compile(*), master(*)])
15:28:40.507 [DEBUG] [org.gradle.api.internal.artifacts.ivyservice.resolveengine.DependencyGraphBuilder] Selecting new module version com.google.guava#guava;r07
15:28:40.507 [DEBUG] [org.gradle.cache.internal.btree.BTreePersistentIndexedCache] Closing cache module-metadata.bin (/home/phil/.gradle/caches/artifacts-8/module-metadata.bin)
15:28:40.508 [DEBUG] [org.gradle.cache.internal.btree.BTreePersistentIndexedCache] Closing cache dynamic-revisions.bin (/home/phil/.gradle/caches/artifacts-8/dynamic-revisions.bin)
15:28:40.508 [DEBUG] [org.gradle.cache.internal.DefaultFileLockManager] Releasing lock on artifact cache (/home/phil/.gradle/caches/artifacts-8).
15:28:40.509 [DEBUG] [org.gradle.api.internal.artifacts.ivyservice.IvyLoggingAdaper]    tried /home/phil/.m2/repository/com/google/guava/guava/r07/guava-r07.pom
15:28:40.509 [DEBUG] [org.gradle.api.internal.artifacts.repositories.ResourceCollectionResolver] Loading /home/phil/.m2/repository/com/google/guava/guava/r07/guava-r07.pom
15:28:40.509 [DEBUG] [org.gradle.api.internal.artifacts.repositories.ResourceCollectionResolver] Resource not reachable for com/google/guava#guava;r07: res=/home/phil/.m2/repository/com/google/guava/guava/r07/guava-r07.pom
15:28:40.510 [DEBUG] [org.gradle.api.internal.artifacts.ivyservice.IvyLoggingAdaper]    tried /home/phil/.m2/repository/com/google/guava/guava/r07/guava-r07.jar
15:28:40.510 [DEBUG] [org.gradle.api.internal.artifacts.repositories.ResourceCollectionResolver] Loading /home/phil/.m2/repository/com/google/guava/guava/r07/guava-r07.jar
15:28:40.510 [DEBUG] [org.gradle.api.internal.artifacts.repositories.ResourceCollectionResolver] Resource not reachable for com/google/guava#guava;r07: res=/home/phil/.m2/repository/com/google/guava/guava/r07/guava-r07.jar
15:28:40.511 [DEBUG] [org.gradle.api.internal.artifacts.ivyservice.IvyLoggingAdaper]  MavenLocal: no ivy file nor artifact found for com.google.guava#guava;r07
15:28:40.511 [DEBUG] [org.gradle.cache.internal.DefaultFileLockManager] Waiting to acquire exclusive lock on artifact cache (/home/phil/.gradle/caches/artifacts-8).
15:28:40.512 [DEBUG] [org.gradle.cache.internal.DefaultFileLockManager] Lock acquired.
15:28:40.512 [DEBUG] [org.gradle.cache.internal.btree.BTreePersistentIndexedCache] Opening cache dynamic-revisions.bin (/home/phil/.gradle/caches/artifacts-8/dynamic-revisions.bin)
15:28:40.512 [DEBUG] [org.gradle.cache.internal.btree.BTreePersistentIndexedCache] Opening cache module-metadata.bin (/home/phil/.gradle/caches/artifacts-8/module-metadata.bin)
15:28:40.514 [DEBUG] [org.gradle.api.internal.artifacts.ivyservice.IvyLoggingAdaper] post 1.3 ivy file: using exact as default matcher
15:28:40.514 [DEBUG] [org.gradle.api.internal.artifacts.ivyservice.ivyresolve.CachingModuleVersionRepository] Using cached module metadata for 'com.google.guava#guava;r07'
15:28:40.515 [DEBUG] [org.gradle.api.internal.artifacts.ivyservice.ivyresolve.UserResolverChain] Found module com.google.guava#guava;r07 using repository maven
15:28:40.515 [DEBUG] [org.gradle.api.internal.artifacts.ivyservice.resolveengine.DependencyGraphBuilder] Visiting dependency ros.rosjava_core#rosjava;0.0.0-SNAPSHOT(compile) -> org.apache.commons#com.springsource.org.apache.commons.net;2.0.0([compile(*), master(*)])
15:28:40.515 [DEBUG] [org.gradle.api.internal.artifacts.ivyservice.resolveengine.DependencyGraphBuilder] Selecting new module version org.apache.commons#com.springsource.org.apache.commons.net;2.0.0
15:28:40.516 [DEBUG] [org.gradle.cache.internal.btree.BTreePersistentIndexedCache] Closing cache module-metadata.bin (/home/phil/.gradle/caches/artifacts-8/module-metadata.bin)
15:28:40.516 [DEBUG] [org.gradle.cache.internal.btree.BTreePersistentIndexedCache] Closing cache dynamic-revisions.bin (/home/phil/.gradle/caches/artifacts-8/dynamic-revisions.bin)
15:28:40.517 [DEBUG] [org.gradle.cache.internal.DefaultFileLockManager] Releasing lock on artifact cache (/home/phil/.gradle/caches/artifacts-8).
15:28:40.517 [DEBUG] [org.gradle.api.internal.artifacts.ivyservice.IvyLoggingAdaper]    tried /home/phil/.m2/repository/org/apache/commons/com.springsource.org.apache.commons.net/2.0.0/com.springsource.org.apache.commons.net-2.0.0.pom
15:28:40.517 [DEBUG] [org.gradle.api.internal.artifacts.repositories.ResourceCollectionResolver] Loading /home/phil/.m2/repository/org/apache/commons/com.springsource.org.apache.commons.net/2.0.0/com.springsource.org.apache.commons.net-2.0.0.pom
15:28:40.518 [DEBUG] [org.gradle.api.internal.artifacts.repositories.ResourceCollectionResolver] Resource not reachable for org/apache/commons#com.springsource.org.apache.commons.net;2.0.0: res=/home/phil/.m2/repository/org/apache/commons/com.springsource.org.apache.commons.net/2.0.0/com.springsource.org.apache.commons.net-2.0.0.pom
15:28:40.518 [DEBUG] [org.gradle.api.internal.artifacts.ivyservice.IvyLoggingAdaper]    tried /home/phil/.m2/repository/org/apache/commons/com.springsource.org.apache.commons.net/2.0.0/com.springsource.org.apache.commons.net-2.0.0.jar
15:28:40.518 [DEBUG] [org.gradle.api.internal.artifacts.repositories.ResourceCollectionResolver] Loading /home/phil/.m2/repository/org/apache/commons/com.springsource.org.apache.commons.net/2.0.0/com.springsource.org.apache.commons.net-2.0.0.jar
15:28:40.519 [DEBUG] [org.gradle.api.internal.artifacts.repositories.ResourceCollectionResolver] Resource not reachable for org/apache/commons#com.springsource.org.apache.commons.net;2.0.0: res=/home/phil/.m2/repository/org/apache/commons/com.springsource.org.apache.commons.net/2.0.0/com.springsource.org.apache.commons.net-2.0.0.jar
15:28:40.519 [DEBUG] [org.gradle.api.internal.artifacts.ivyservice.IvyLoggingAdaper]  MavenLocal: no ivy file nor artifact found for org.apache.commons#com.springsource.org.apache.commons.net;2.0.0
15:28:40.520 [DEBUG] [org.gradle.cache.internal.DefaultFileLockManager] Waiting to acquire exclusive lock on artifact cache (/home/phil/.gradle/caches/artifacts-8).
15:28:40.520 [DEBUG] [org.gradle.cache.internal.DefaultFileLockManager] Lock acquired.
15:28:40.521 [DEBUG] [org.gradle.cache.internal.btree.BTreePersistentIndexedCache] Opening cache dynamic-revisions.bin (/home/phil/.gradle/caches/artifacts-8/dynamic-revisions.bin)
15:28:40.521 [DEBUG] [org.gradle.cache.internal.btree.BTreePersistentIndexedCache] Opening cache module-metadata.bin (/home/phil/.gradle/caches/artifacts-8/module-metadata.bin)
15:28:40.523 [DEBUG] [org.gradle.api.internal.artifacts.ivyservice.IvyLoggingAdaper] post 1.3 ivy file: using exact as default matcher
15:28:40.523 [DEBUG] [org.gradle.api.internal.artifacts.ivyservice.ivyresolve.CachingModuleVersionRepository] Using cached module metadata for 'org.apache.commons#com.springsource.org.apache.commons.net;2.0.0'
15:28:40.524 [DEBUG] [org.gradle.api.internal.artifacts.ivyservice.ivyresolve.UserResolverChain] Found module org.apache.commons#com.springsource.org.apache.commons.net;2.0.0 using repository maven
15:28:40.524 [DEBUG] [org.gradle.api.internal.artifacts.ivyservice.resolveengine.DependencyGraphBuilder] Visiting dependency ros.rosjava_core#rosjava;0.0.0-SNAPSHOT(compile) -> org.apache.commons#com.springsource.org.apache.commons.logging;1.1.1([compile(*), master(*)])
15:28:40.525 [DEBUG] [org.gradle.api.internal.artifacts.ivyservice.resolveengine.DependencyGraphBuilder] Selecting new module version org.apache.commons#com.springsource.org.apache.commons.logging;1.1.1
15:28:40.525 [DEBUG] [org.gradle.cache.internal.btree.BTreePersistentIndexedCache] Closing cache module-metadata.bin (/home/phil/.gradle/caches/artifacts-8/module-metadata.bin)
15:28:40.525 [DEBUG] [org.gradle.cache.internal.btree.BTreePersistentIndexedCache] Closing cache dynamic-revisions.bin (/home/phil/.gradle/caches/artifacts-8/dynamic-revisions.bin)
15:28:40.526 [DEBUG] [org.gradle.cache.internal.DefaultFileLockManager] Releasing lock on artifact cache (/home/phil/.gradle/caches/artifacts-8).
15:28:40.526 [DEBUG] [org.gradle.api.internal.artifacts.ivyservice.IvyLoggingAdaper]    tried /home/phil/.m2/repository/org/apache/commons/com.springsource.org.apache.commons.logging/1.1.1/com.springsource.org.apache.commons.logging-1.1.1.pom
15:28:40.526 [DEBUG] [org.gradle.api.internal.artifacts.repositories.ResourceCollectionResolver] Loading /home/phil/.m2/repository/org/apache/commons/com.springsource.org.apache.commons.logging/1.1.1/com.springsource.org.apache.commons.logging-1.1.1.pom
15:28:40.527 [DEBUG] [org.gradle.api.internal.artifacts.repositories.ResourceCollectionResolver] Resource not reachable for org/apache/commons#com.springsource.org.apache.commons.logging;1.1.1: res=/home/phil/.m2/repository/org/apache/commons/com.springsource.org.apache.commons.logging/1.1.1/com.springsource.org.apache.commons.logging-1.1.1.pom
15:28:40.527 [DEBUG] [org.gradle.api.internal.artifacts.ivyservice.IvyLoggingAdaper]    tried /home/phil/.m2/repository/org/apache/commons/com.springsource.org.apache.commons.logging/1.1.1/com.springsource.org.apache.commons.logging-1.1.1.jar
15:28:40.528 [DEBUG] [org.gradle.api.internal.artifacts.repositories.ResourceCollectionResolver] Loading /home/phil/.m2/repository/org/apache/commons/com.springsource.org.apache.commons.logging/1.1.1/com.springsource.org.apache.commons.logging-1.1.1.jar
15:28:40.528 [DEBUG] [org.gradle.api.internal.artifacts.repositories.ResourceCollectionResolver] Resource not reachable for org/apache/commons#com.springsource.org.apache.commons.logging;1.1.1: res=/home/phil/.m2/repository/org/apache/commons/com.springsource.org.apache.commons.logging/1.1.1/com.springsource.org.apache.commons.logging-1.1.1.jar
15:28:40.528 [DEBUG] [org.gradle.api.internal.artifacts.ivyservice.IvyLoggingAdaper]  MavenLocal: no ivy file nor artifact found for org.apache.commons#com.springsource.org.apache.commons.logging;1.1.1
15:28:40.529 [DEBUG] [org.gradle.cache.internal.DefaultFileLockManager] Waiting to acquire exclusive lock on artifact cache (/home/phil/.gradle/caches/artifacts-8).
15:28:40.529 [DEBUG] [org.gradle.cache.internal.DefaultFileLockManager] Lock acquired.
15:28:40.530 [DEBUG] [org.gradle.cache.internal.btree.BTreePersistentIndexedCache] Opening cache dynamic-revisions.bin (/home/phil/.gradle/caches/artifacts-8/dynamic-revisions.bin)
15:28:40.530 [DEBUG] [org.gradle.cache.internal.btree.BTreePersistentIndexedCache] Opening cache module-metadata.bin (/home/phil/.gradle/caches/artifacts-8/module-metadata.bin)
15:28:40.531 [DEBUG] [org.gradle.api.internal.artifacts.ivyservice.IvyLoggingAdaper] post 1.3 ivy file: using exact as default matcher
15:28:40.532 [DEBUG] [org.gradle.api.internal.artifacts.ivyservice.ivyresolve.CachingModuleVersionRepository] Using cached module metadata for 'org.apache.commons#com.springsource.org.apache.commons.logging;1.1.1'
15:28:40.532 [DEBUG] [org.gradle.api.internal.artifacts.ivyservice.ivyresolve.UserResolverChain] Found module org.apache.commons#com.springsource.org.apache.commons.logging;1.1.1 using repository maven
15:28:40.533 [DEBUG] [org.gradle.api.internal.artifacts.ivyservice.resolveengine.DependencyGraphBuilder] Visiting dependency ros.rosjava_core#rosjava;0.0.0-SNAPSHOT(compile) -> ros.rosjava_core#rosjava_messages;0.0.0-SNAPSHOT([compile(*), master(*)])
15:28:40.533 [DEBUG] [org.gradle.api.internal.artifacts.ivyservice.resolveengine.DependencyGraphBuilder] Selecting new module version ros.rosjava_core#rosjava_messages;0.0.0-SNAPSHOT
15:28:40.533 [DEBUG] [org.gradle.cache.internal.btree.BTreePersistentIndexedCache] Closing cache module-metadata.bin (/home/phil/.gradle/caches/artifacts-8/module-metadata.bin)
15:28:40.534 [DEBUG] [org.gradle.cache.internal.btree.BTreePersistentIndexedCache] Closing cache dynamic-revisions.bin (/home/phil/.gradle/caches/artifacts-8/dynamic-revisions.bin)
15:28:40.534 [DEBUG] [org.gradle.cache.internal.DefaultFileLockManager] Releasing lock on artifact cache (/home/phil/.gradle/caches/artifacts-8).
15:28:40.535 [DEBUG] [org.gradle.api.internal.artifacts.repositories.MavenResolver] maven-metadata not available: /home/phil/.m2/repository/ros/rosjava_core/rosjava_messages/0.0.0-SNAPSHOT/maven-metadata.xml
15:28:40.535 [DEBUG] [org.gradle.api.internal.artifacts.ivyservice.IvyLoggingAdaper]    tried /home/phil/.m2/repository/ros/rosjava_core/rosjava_messages/0.0.0-SNAPSHOT/rosjava_messages-0.0.0-SNAPSHOT.pom
15:28:40.535 [DEBUG] [org.gradle.api.internal.artifacts.repositories.ResourceCollectionResolver] Loading /home/phil/.m2/repository/ros/rosjava_core/rosjava_messages/0.0.0-SNAPSHOT/rosjava_messages-0.0.0-SNAPSHOT.pom
15:28:40.536 [DEBUG] [org.gradle.api.internal.artifacts.ivyservice.IvyLoggingAdaper]  MavenLocal: found md file for ros.rosjava_core#rosjava_messages;0.0.0-SNAPSHOT
15:28:40.536 [DEBUG] [org.gradle.api.internal.artifacts.ivyservice.IvyLoggingAdaper]    => /home/phil/.m2/repository/ros/rosjava_core/rosjava_messages/0.0.0-SNAPSHOT/rosjava_messages-0.0.0-SNAPSHOT.pom (0.0.0-SNAPSHOT)
15:28:40.537 [DEBUG] [org.gradle.api.internal.artifacts.ivyservice.IvyLoggingAdaper]  parser = pom parser
15:28:40.538 [DEBUG] [org.gradle.api.internal.artifacts.ivyservice.IvyLoggingAdaper]  checking ros.rosjava_core#rosjava_messages;0.0.0-SNAPSHOT from MavenLocal against [none]
15:28:40.539 [DEBUG] [org.gradle.api.internal.artifacts.ivyservice.IvyLoggingAdaper]  module revision kept as first found: ros.rosjava_core#rosjava_messages;0.0.0-SNAPSHOT from MavenLocal
15:28:40.539 [DEBUG] [org.gradle.api.internal.artifacts.ivyservice.ivyresolve.UserResolverChain] Found module ros.rosjava_core#rosjava_messages;0.0.0-SNAPSHOT using repository MavenLocal
15:28:40.539 [DEBUG] [org.gradle.api.internal.artifacts.ivyservice.resolveengine.DependencyGraphBuilder] Visiting dependency ros.rosjava_core#rosjava;0.0.0-SNAPSHOT(compile) -> ros.rosjava_core#apache_xmlrpc_client;0.0.0-SNAPSHOT([compile(*), master(*)])
15:28:40.540 [DEBUG] [org.gradle.api.internal.artifacts.ivyservice.resolveengine.DependencyGraphBuilder] Selecting new module version ros.rosjava_core#apache_xmlrpc_client;0.0.0-SNAPSHOT
15:28:40.540 [DEBUG] [org.gradle.api.internal.artifacts.repositories.MavenResolver] maven-metadata not available: /home/phil/.m2/repository/ros/rosjava_core/apache_xmlrpc_client/0.0.0-SNAPSHOT/maven-metadata.xml
15:28:40.541 [DEBUG] [org.gradle.api.internal.artifacts.ivyservice.IvyLoggingAdaper]    tried /home/phil/.m2/repository/ros/rosjava_core/apache_xmlrpc_client/0.0.0-SNAPSHOT/apache_xmlrpc_client-0.0.0-SNAPSHOT.pom
15:28:40.541 [DEBUG] [org.gradle.api.internal.artifacts.repositories.ResourceCollectionResolver] Loading /home/phil/.m2/repository/ros/rosjava_core/apache_xmlrpc_client/0.0.0-SNAPSHOT/apache_xmlrpc_client-0.0.0-SNAPSHOT.pom
15:28:40.541 [DEBUG] [org.gradle.api.internal.artifacts.ivyservice.IvyLoggingAdaper]  MavenLocal: found md file for ros.rosjava_core#apache_xmlrpc_client;0.0.0-SNAPSHOT
15:28:40.542 [DEBUG] [org.gradle.api.internal.artifacts.ivyservice.IvyLoggingAdaper]    => /home/phil/.m2/repository/ros/rosjava_core/apache_xmlrpc_client/0.0.0-SNAPSHOT/apache_xmlrpc_client-0.0.0-SNAPSHOT.pom (0.0.0-SNAPSHOT)
15:28:40.542 [DEBUG] [org.gradle.api.internal.artifacts.ivyservice.IvyLoggingAdaper]  parser = pom parser
15:28:40.544 [DEBUG] [org.gradle.api.internal.artifacts.ivyservice.IvyLoggingAdaper]  checking ros.rosjava_core#apache_xmlrpc_client;0.0.0-SNAPSHOT from MavenLocal against [none]
15:28:40.544 [DEBUG] [org.gradle.api.internal.artifacts.ivyservice.IvyLoggingAdaper]  module revision kept as first found: ros.rosjava_core#apache_xmlrpc_client;0.0.0-SNAPSHOT from MavenLocal
15:28:40.545 [DEBUG] [org.gradle.api.internal.artifacts.ivyservice.ivyresolve.UserResolverChain] Found module ros.rosjava_core#apache_xmlrpc_client;0.0.0-SNAPSHOT using repository MavenLocal
15:28:40.545 [DEBUG] [org.gradle.api.internal.artifacts.ivyservice.resolveengine.DependencyGraphBuilder] Visiting dependency ros.rosjava_core#rosjava;0.0.0-SNAPSHOT(compile) -> ros.rosjava_core#apache_xmlrpc_common;0.0.0-SNAPSHOT([compile(*), master(*)])
15:28:40.545 [DEBUG] [org.gradle.api.internal.artifacts.ivyservice.resolveengine.DependencyGraphBuilder] Selecting new module version ros.rosjava_core#apache_xmlrpc_common;0.0.0-SNAPSHOT
15:28:40.546 [DEBUG] [org.gradle.api.internal.artifacts.repositories.MavenResolver] maven-metadata not available: /home/phil/.m2/repository/ros/rosjava_core/apache_xmlrpc_common/0.0.0-SNAPSHOT/maven-metadata.xml
15:28:40.546 [DEBUG] [org.gradle.api.internal.artifacts.ivyservice.IvyLoggingAdaper]    tried /home/phil/.m2/repository/ros/rosjava_core/apache_xmlrpc_common/0.0.0-SNAPSHOT/apache_xmlrpc_common-0.0.0-SNAPSHOT.pom
15:28:40.547 [DEBUG] [org.gradle.api.internal.artifacts.repositories.ResourceCollectionResolver] Loading /home/phil/.m2/repository/ros/rosjava_core/apache_xmlrpc_common/0.0.0-SNAPSHOT/apache_xmlrpc_common-0.0.0-SNAPSHOT.pom
15:28:40.547 [DEBUG] [org.gradle.api.internal.artifacts.ivyservice.IvyLoggingAdaper]  MavenLocal: found md file for ros.rosjava_core#apache_xmlrpc_common;0.0.0-SNAPSHOT
15:28:40.547 [DEBUG] [org.gradle.api.internal.artifacts.ivyservice.IvyLoggingAdaper]    => /home/phil/.m2/repository/ros/rosjava_core/apache_xmlrpc_common/0.0.0-SNAPSHOT/apache_xmlrpc_common-0.0.0-SNAPSHOT.pom (0.0.0-SNAPSHOT)
15:28:40.548 [DEBUG] [org.gradle.api.internal.artifacts.ivyservice.IvyLoggingAdaper]  parser = pom parser
15:28:40.549 [DEBUG] [org.gradle.api.internal.artifacts.ivyservice.IvyLoggingAdaper]  checking ros.rosjava_core#apache_xmlrpc_common;0.0.0-SNAPSHOT from MavenLocal against [none]
15:28:40.550 [DEBUG] [org.gradle.api.internal.artifacts.ivyservice.IvyLoggingAdaper]  module revision kept as first found: ros.rosjava_core#apache_xmlrpc_common;0.0.0-SNAPSHOT from MavenLocal
15:28:40.550 [DEBUG] [org.gradle.api.internal.artifacts.ivyservice.ivyresolve.UserResolverChain] Found module ros.rosjava_core#apache_xmlrpc_common;0.0.0-SNAPSHOT using repository MavenLocal
15:28:40.551 [DEBUG] [org.gradle.api.internal.artifacts.ivyservice.resolveengine.DependencyGraphBuilder] Visiting dependency ros.rosjava_core#rosjava;0.0.0-SNAPSHOT(compile) -> ros.rosjava_core#rosjava_bootstrap;0.0.0-SNAPSHOT([compile(*), master(*)])
15:28:40.551 [DEBUG] [org.gradle.api.internal.artifacts.ivyservice.resolveengine.DependencyGraphBuilder] Selecting new module version ros.rosjava_core#rosjava_bootstrap;0.0.0-SNAPSHOT
15:28:40.552 [DEBUG] [org.gradle.api.internal.artifacts.repositories.MavenResolver] maven-metadata not available: /home/phil/.m2/repository/ros/rosjava_core/rosjava_bootstrap/0.0.0-SNAPSHOT/maven-metadata.xml
15:28:40.552 [DEBUG] [org.gradle.api.internal.artifacts.ivyservice.IvyLoggingAdaper]    tried /home/phil/.m2/repository/ros/rosjava_core/rosjava_bootstrap/0.0.0-SNAPSHOT/rosjava_bootstrap-0.0.0-SNAPSHOT.pom
15:28:40.552 [DEBUG] [org.gradle.api.internal.artifacts.repositories.ResourceCollectionResolver] Loading /home/phil/.m2/repository/ros/rosjava_core/rosjava_bootstrap/0.0.0-SNAPSHOT/rosjava_bootstrap-0.0.0-SNAPSHOT.pom
15:28:40.553 [DEBUG] [org.gradle.api.internal.artifacts.ivyservice.IvyLoggingAdaper]  MavenLocal: found md file for ros.rosjava_core#rosjava_bootstrap;0.0.0-SNAPSHOT
15:28:40.553 [DEBUG] [org.gradle.api.internal.artifacts.ivyservice.IvyLoggingAdaper]    => /home/phil/.m2/repository/ros/rosjava_core/rosjava_bootstrap/0.0.0-SNAPSHOT/rosjava_bootstrap-0.0.0-SNAPSHOT.pom (0.0.0-SNAPSHOT)
15:28:40.554 [DEBUG] [org.gradle.api.internal.artifacts.ivyservice.IvyLoggingAdaper]  parser = pom parser
15:28:40.556 [DEBUG] [org.gradle.api.internal.artifacts.ivyservice.IvyLoggingAdaper]  checking ros.rosjava_core#rosjava_bootstrap;0.0.0-SNAPSHOT from MavenLocal against [none]
15:28:40.556 [DEBUG] [org.gradle.api.internal.artifacts.ivyservice.IvyLoggingAdaper]  module revision kept as first found: ros.rosjava_core#rosjava_bootstrap;0.0.0-SNAPSHOT from MavenLocal
15:28:40.557 [DEBUG] [org.gradle.api.internal.artifacts.ivyservice.ivyresolve.UserResolverChain] Found module ros.rosjava_core#rosjava_bootstrap;0.0.0-SNAPSHOT using repository MavenLocal
15:28:40.557 [DEBUG] [org.gradle.api.internal.artifacts.ivyservice.resolveengine.DependencyGraphBuilder] Visiting dependency ros.rosjava_core#rosjava;0.0.0-SNAPSHOT(compile) -> ros.rosjava_core#apache_xmlrpc_server;0.0.0-SNAPSHOT([compile(*), master(*)])
15:28:40.558 [DEBUG] [org.gradle.api.internal.artifacts.ivyservice.resolveengine.DependencyGraphBuilder] Selecting new module version ros.rosjava_core#apache_xmlrpc_server;0.0.0-SNAPSHOT
15:28:40.558 [DEBUG] [org.gradle.api.internal.artifacts.repositories.MavenResolver] maven-metadata not available: /home/phil/.m2/repository/ros/rosjava_core/apache_xmlrpc_server/0.0.0-SNAPSHOT/maven-metadata.xml
15:28:40.558 [DEBUG] [org.gradle.api.internal.artifacts.ivyservice.IvyLoggingAdaper]    tried /home/phil/.m2/repository/ros/rosjava_core/apache_xmlrpc_server/0.0.0-SNAPSHOT/apache_xmlrpc_server-0.0.0-SNAPSHOT.pom
15:28:40.559 [DEBUG] [org.gradle.api.internal.artifacts.repositories.ResourceCollectionResolver] Loading /home/phil/.m2/repository/ros/rosjava_core/apache_xmlrpc_server/0.0.0-SNAPSHOT/apache_xmlrpc_server-0.0.0-SNAPSHOT.pom
15:28:40.559 [DEBUG] [org.gradle.api.internal.artifacts.ivyservice.IvyLoggingAdaper]  MavenLocal: found md file for ros.rosjava_core#apache_xmlrpc_server;0.0.0-SNAPSHOT
15:28:40.560 [DEBUG] [org.gradle.api.internal.artifacts.ivyservice.IvyLoggingAdaper]    => /home/phil/.m2/repository/ros/rosjava_core/apache_xmlrpc_server/0.0.0-SNAPSHOT/apache_xmlrpc_server-0.0.0-SNAPSHOT.pom (0.0.0-SNAPSHOT)
15:28:40.560 [DEBUG] [org.gradle.api.internal.artifacts.ivyservice.IvyLoggingAdaper]  parser = pom parser
15:28:40.562 [DEBUG] [org.gradle.api.internal.artifacts.ivyservice.IvyLoggingAdaper]  checking ros.rosjava_core#apache_xmlrpc_server;0.0.0-SNAPSHOT from MavenLocal against [none]
15:28:40.562 [DEBUG] [org.gradle.api.internal.artifacts.ivyservice.IvyLoggingAdaper]  module revision kept as first found: ros.rosjava_core#apache_xmlrpc_server;0.0.0-SNAPSHOT from MavenLocal
15:28:40.563 [DEBUG] [org.gradle.api.internal.artifacts.ivyservice.ivyresolve.UserResolverChain] Found module ros.rosjava_core#apache_xmlrpc_server;0.0.0-SNAPSHOT using repository MavenLocal
15:28:40.563 [DEBUG] [org.gradle.api.internal.artifacts.ivyservice.resolveengine.DependencyGraphBuilder] Visiting dependency ros.rosjava_core#rosjava;0.0.0-SNAPSHOT(compile) -> dnsjava#dnsjava;2.1.1([compile(*), master(*)])
15:28:40.563 [DEBUG] [org.gradle.api.internal.artifacts.ivyservice.resolveengine.DependencyGraphBuilder] Selecting new module version dnsjava#dnsjava;2.1.1
15:28:40.564 [DEBUG] [org.gradle.api.internal.artifacts.ivyservice.IvyLoggingAdaper]    tried /home/phil/.m2/repository/dnsjava/dnsjava/2.1.1/dnsjava-2.1.1.pom
15:28:40.564 [DEBUG] [org.gradle.api.internal.artifacts.repositories.ResourceCollectionResolver] Loading /home/phil/.m2/repository/dnsjava/dnsjava/2.1.1/dnsjava-2.1.1.pom
15:28:40.565 [DEBUG] [org.gradle.api.internal.artifacts.repositories.ResourceCollectionResolver] Resource not reachable for dnsjava#dnsjava;2.1.1: res=/home/phil/.m2/repository/dnsjava/dnsjava/2.1.1/dnsjava-2.1.1.pom
15:28:40.565 [DEBUG] [org.gradle.api.internal.artifacts.ivyservice.IvyLoggingAdaper]    tried /home/phil/.m2/repository/dnsjava/dnsjava/2.1.1/dnsjava-2.1.1.jar
15:28:40.565 [DEBUG] [org.gradle.api.internal.artifacts.repositories.ResourceCollectionResolver] Loading /home/phil/.m2/repository/dnsjava/dnsjava/2.1.1/dnsjava-2.1.1.jar
15:28:40.566 [DEBUG] [org.gradle.api.internal.artifacts.repositories.ResourceCollectionResolver] Resource not reachable for dnsjava#dnsjava;2.1.1: res=/home/phil/.m2/repository/dnsjava/dnsjava/2.1.1/dnsjava-2.1.1.jar
15:28:40.566 [DEBUG] [org.gradle.api.internal.artifacts.ivyservice.IvyLoggingAdaper]  MavenLocal: no ivy file nor artifact found for dnsjava#dnsjava;2.1.1
15:28:40.567 [DEBUG] [org.gradle.cache.internal.DefaultFileLockManager] Waiting to acquire exclusive lock on artifact cache (/home/phil/.gradle/caches/artifacts-8).
15:28:40.567 [DEBUG] [org.gradle.cache.internal.DefaultFileLockManager] Lock acquired.
15:28:40.567 [DEBUG] [org.gradle.cache.internal.btree.BTreePersistentIndexedCache] Opening cache dynamic-revisions.bin (/home/phil/.gradle/caches/artifacts-8/dynamic-revisions.bin)
15:28:40.568 [DEBUG] [org.gradle.cache.internal.btree.BTreePersistentIndexedCache] Opening cache module-metadata.bin (/home/phil/.gradle/caches/artifacts-8/module-metadata.bin)
15:28:40.569 [DEBUG] [org.gradle.api.internal.artifacts.ivyservice.IvyLoggingAdaper] post 1.3 ivy file: using exact as default matcher
15:28:40.570 [DEBUG] [org.gradle.api.internal.artifacts.ivyservice.ivyresolve.CachingModuleVersionRepository] Using cached module metadata for 'dnsjava#dnsjava;2.1.1'
15:28:40.570 [DEBUG] [org.gradle.api.internal.artifacts.ivyservice.ivyresolve.UserResolverChain] Found module dnsjava#dnsjava;2.1.1 using repository maven
15:28:40.571 [DEBUG] [org.gradle.api.internal.artifacts.ivyservice.resolveengine.DependencyGraphBuilder] Visiting configuration ros.rosjava_core#rosjava;0.0.0-SNAPSHOT(master).
15:28:40.571 [DEBUG] [org.gradle.api.internal.artifacts.ivyservice.resolveengine.DependencyGraphBuilder] Visiting configuration ros.rosjava_core#rosjava;0.0.0-SNAPSHOT(runtime).
15:28:40.571 [DEBUG] [org.gradle.api.internal.artifacts.ivyservice.resolveengine.DependencyGraphBuilder] Visiting dependency ros.rosjava_core#rosjava;0.0.0-SNAPSHOT(runtime) -> org.jboss.netty#netty;3.2.4.Final([compile(*), master(*), runtime(*)])
15:28:40.572 [DEBUG] [org.gradle.api.internal.artifacts.ivyservice.resolveengine.DependencyGraphBuilder] Visiting dependency ros.rosjava_core#rosjava;0.0.0-SNAPSHOT(runtime) -> com.google.guava#guava;r07([compile(*), master(*), runtime(*)])
15:28:40.572 [DEBUG] [org.gradle.api.internal.artifacts.ivyservice.resolveengine.DependencyGraphBuilder] Visiting dependency ros.rosjava_core#rosjava;0.0.0-SNAPSHOT(runtime) -> org.apache.commons#com.springsource.org.apache.commons.net;2.0.0([compile(*), master(*), runtime(*)])
15:28:40.572 [DEBUG] [org.gradle.api.internal.artifacts.ivyservice.resolveengine.DependencyGraphBuilder] Visiting dependency ros.rosjava_core#rosjava;0.0.0-SNAPSHOT(runtime) -> org.apache.commons#com.springsource.org.apache.commons.logging;1.1.1([compile(*), master(*), runtime(*)])
15:28:40.573 [DEBUG] [org.gradle.api.internal.artifacts.ivyservice.resolveengine.DependencyGraphBuilder] Visiting dependency ros.rosjava_core#rosjava;0.0.0-SNAPSHOT(runtime) -> ros.rosjava_core#rosjava_messages;0.0.0-SNAPSHOT([compile(*), master(*), runtime(*)])
15:28:40.573 [DEBUG] [org.gradle.api.internal.artifacts.ivyservice.resolveengine.DependencyGraphBuilder] Visiting dependency ros.rosjava_core#rosjava;0.0.0-SNAPSHOT(runtime) -> ros.rosjava_core#apache_xmlrpc_client;0.0.0-SNAPSHOT([compile(*), master(*), runtime(*)])
15:28:40.574 [DEBUG] [org.gradle.api.internal.artifacts.ivyservice.resolveengine.DependencyGraphBuilder] Visiting dependency ros.rosjava_core#rosjava;0.0.0-SNAPSHOT(runtime) -> ros.rosjava_core#apache_xmlrpc_common;0.0.0-SNAPSHOT([compile(*), master(*), runtime(*)])
15:28:40.574 [DEBUG] [org.gradle.api.internal.artifacts.ivyservice.resolveengine.DependencyGraphBuilder] Visiting dependency ros.rosjava_core#rosjava;0.0.0-SNAPSHOT(runtime) -> ros.rosjava_core#rosjava_bootstrap;0.0.0-SNAPSHOT([compile(*), master(*), runtime(*)])
15:28:40.574 [DEBUG] [org.gradle.api.internal.artifacts.ivyservice.resolveengine.DependencyGraphBuilder] Visiting dependency ros.rosjava_core#rosjava;0.0.0-SNAPSHOT(runtime) -> ros.rosjava_core#apache_xmlrpc_server;0.0.0-SNAPSHOT([compile(*), master(*), runtime(*)])
15:28:40.575 [DEBUG] [org.gradle.api.internal.artifacts.ivyservice.resolveengine.DependencyGraphBuilder] Visiting dependency ros.rosjava_core#rosjava;0.0.0-SNAPSHOT(runtime) -> dnsjava#dnsjava;2.1.1([compile(*), master(*), runtime(*)])
15:28:40.575 [DEBUG] [org.gradle.api.internal.artifacts.ivyservice.resolveengine.DependencyGraphBuilder] Visiting configuration org.jboss.netty#netty;3.2.4.Final(compile).
15:28:40.575 [DEBUG] [org.gradle.api.internal.artifacts.ivyservice.resolveengine.DependencyGraphBuilder] Visiting configuration org.jboss.netty#netty;3.2.4.Final(master).
15:28:40.576 [DEBUG] [org.gradle.api.internal.artifacts.ivyservice.resolveengine.DependencyGraphBuilder] Visiting configuration com.google.guava#guava;r07(compile).
15:28:40.576 [DEBUG] [org.gradle.api.internal.artifacts.ivyservice.resolveengine.DependencyGraphBuilder] Visiting configuration com.google.guava#guava;r07(master).
15:28:40.576 [DEBUG] [org.gradle.api.internal.artifacts.ivyservice.resolveengine.DependencyGraphBuilder] Visiting configuration org.apache.commons#com.springsource.org.apache.commons.net;2.0.0(compile).
15:28:40.577 [DEBUG] [org.gradle.api.internal.artifacts.ivyservice.resolveengine.DependencyGraphBuilder] Visiting configuration org.apache.commons#com.springsource.org.apache.commons.net;2.0.0(master).
15:28:40.577 [DEBUG] [org.gradle.api.internal.artifacts.ivyservice.resolveengine.DependencyGraphBuilder] Visiting configuration org.apache.commons#com.springsource.org.apache.commons.logging;1.1.1(compile).
15:28:40.577 [DEBUG] [org.gradle.api.internal.artifacts.ivyservice.resolveengine.DependencyGraphBuilder] Visiting configuration org.apache.commons#com.springsource.org.apache.commons.logging;1.1.1(master).
15:28:40.578 [DEBUG] [org.gradle.api.internal.artifacts.ivyservice.resolveengine.DependencyGraphBuilder] Visiting configuration ros.rosjava_core#rosjava_messages;0.0.0-SNAPSHOT(compile).
15:28:40.578 [DEBUG] [org.gradle.api.internal.artifacts.ivyservice.resolveengine.DependencyGraphBuilder] Visiting dependency ros.rosjava_core#rosjava_messages;0.0.0-SNAPSHOT(compile) -> ros.rosjava_core#rosjava_bootstrap;0.0.0-SNAPSHOT([compile(*), master(*)])
15:28:40.578 [DEBUG] [org.gradle.api.internal.artifacts.ivyservice.resolveengine.DependencyGraphBuilder] Visiting configuration ros.rosjava_core#rosjava_messages;0.0.0-SNAPSHOT(master).
15:28:40.579 [DEBUG] [org.gradle.api.internal.artifacts.ivyservice.resolveengine.DependencyGraphBuilder] Visiting configuration ros.rosjava_core#apache_xmlrpc_client;0.0.0-SNAPSHOT(compile).
15:28:40.579 [DEBUG] [org.gradle.api.internal.artifacts.ivyservice.resolveengine.DependencyGraphBuilder] Visiting dependency ros.rosjava_core#apache_xmlrpc_client;0.0.0-SNAPSHOT(compile) -> org.apache.ws.commons#ws-commons-util;1.0.1([compile(*), master(*)])
15:28:40.579 [DEBUG] [org.gradle.api.internal.artifacts.ivyservice.resolveengine.DependencyGraphBuilder] Selecting new module version org.apache.ws.commons#ws-commons-util;1.0.1
15:28:40.580 [DEBUG] [org.gradle.cache.internal.btree.BTreePersistentIndexedCache] Closing cache module-metadata.bin (/home/phil/.gradle/caches/artifacts-8/module-metadata.bin)
15:28:40.580 [DEBUG] [org.gradle.cache.internal.btree.BTreePersistentIndexedCache] Closing cache dynamic-revisions.bin (/home/phil/.gradle/caches/artifacts-8/dynamic-revisions.bin)
15:28:40.581 [DEBUG] [org.gradle.cache.internal.DefaultFileLockManager] Releasing lock on artifact cache (/home/phil/.gradle/caches/artifacts-8).
15:28:40.581 [DEBUG] [org.gradle.api.internal.artifacts.ivyservice.IvyLoggingAdaper]    tried /home/phil/.m2/repository/org/apache/ws/commons/ws-commons-util/1.0.1/ws-commons-util-1.0.1.pom
15:28:40.581 [DEBUG] [org.gradle.api.internal.artifacts.repositories.ResourceCollectionResolver] Loading /home/phil/.m2/repository/org/apache/ws/commons/ws-commons-util/1.0.1/ws-commons-util-1.0.1.pom
15:28:40.582 [DEBUG] [org.gradle.api.internal.artifacts.repositories.ResourceCollectionResolver] Resource not reachable for org/apache/ws/commons#ws-commons-util;1.0.1: res=/home/phil/.m2/repository/org/apache/ws/commons/ws-commons-util/1.0.1/ws-commons-util-1.0.1.pom
15:28:40.582 [DEBUG] [org.gradle.api.internal.artifacts.ivyservice.IvyLoggingAdaper]    tried /home/phil/.m2/repository/org/apache/ws/commons/ws-commons-util/1.0.1/ws-commons-util-1.0.1.jar
15:28:40.583 [DEBUG] [org.gradle.api.internal.artifacts.repositories.ResourceCollectionResolver] Loading /home/phil/.m2/repository/org/apache/ws/commons/ws-commons-util/1.0.1/ws-commons-util-1.0.1.jar
15:28:40.583 [DEBUG] [org.gradle.api.internal.artifacts.repositories.ResourceCollectionResolver] Resource not reachable for org/apache/ws/commons#ws-commons-util;1.0.1: res=/home/phil/.m2/repository/org/apache/ws/commons/ws-commons-util/1.0.1/ws-commons-util-1.0.1.jar
15:28:40.584 [DEBUG] [org.gradle.api.internal.artifacts.ivyservice.IvyLoggingAdaper]  MavenLocal: no ivy file nor artifact found for org.apache.ws.commons#ws-commons-util;1.0.1
15:28:40.584 [DEBUG] [org.gradle.cache.internal.DefaultFileLockManager] Waiting to acquire exclusive lock on artifact cache (/home/phil/.gradle/caches/artifacts-8).
15:28:40.585 [DEBUG] [org.gradle.cache.internal.DefaultFileLockManager] Lock acquired.
15:28:40.585 [DEBUG] [org.gradle.cache.internal.btree.BTreePersistentIndexedCache] Opening cache dynamic-revisions.bin (/home/phil/.gradle/caches/artifacts-8/dynamic-revisions.bin)
15:28:40.585 [DEBUG] [org.gradle.cache.internal.btree.BTreePersistentIndexedCache] Opening cache module-metadata.bin (/home/phil/.gradle/caches/artifacts-8/module-metadata.bin)
15:28:40.587 [DEBUG] [org.gradle.api.internal.artifacts.ivyservice.IvyLoggingAdaper] post 1.3 ivy file: using exact as default matcher
15:28:40.588 [DEBUG] [org.gradle.api.internal.artifacts.ivyservice.ivyresolve.CachingModuleVersionRepository] Using cached module metadata for 'org.apache.ws.commons#ws-commons-util;1.0.1'
15:28:40.588 [DEBUG] [org.gradle.api.internal.artifacts.ivyservice.ivyresolve.UserResolverChain] Found module org.apache.ws.commons#ws-commons-util;1.0.1 using repository maven
15:28:40.589 [DEBUG] [org.gradle.api.internal.artifacts.ivyservice.resolveengine.DependencyGraphBuilder] Visiting dependency ros.rosjava_core#apache_xmlrpc_client;0.0.0-SNAPSHOT(compile) -> ros.rosjava_core#apache_xmlrpc_common;0.0.0-SNAPSHOT([compile(*), master(*)])
15:28:40.589 [DEBUG] [org.gradle.api.internal.artifacts.ivyservice.resolveengine.DependencyGraphBuilder] Visiting configuration ros.rosjava_core#apache_xmlrpc_client;0.0.0-SNAPSHOT(master).
15:28:40.589 [DEBUG] [org.gradle.api.internal.artifacts.ivyservice.resolveengine.DependencyGraphBuilder] Visiting configuration ros.rosjava_core#apache_xmlrpc_common;0.0.0-SNAPSHOT(compile).
15:28:40.590 [DEBUG] [org.gradle.api.internal.artifacts.ivyservice.resolveengine.DependencyGraphBuilder] Visiting dependency ros.rosjava_core#apache_xmlrpc_common;0.0.0-SNAPSHOT(compile) -> org.apache.ws.commons#ws-commons-util;1.0.1([compile(*), master(*)])
15:28:40.590 [DEBUG] [org.gradle.api.internal.artifacts.ivyservice.resolveengine.DependencyGraphBuilder] Visiting dependency ros.rosjava_core#apache_xmlrpc_common;0.0.0-SNAPSHOT(compile) -> org.apache.commons#com.springsource.org.apache.commons.httpclient;3.1.0([compile(*), master(*)])
15:28:40.590 [DEBUG] [org.gradle.api.internal.artifacts.ivyservice.resolveengine.DependencyGraphBuilder] Selecting new module version org.apache.commons#com.springsource.org.apache.commons.httpclient;3.1.0
15:28:40.591 [DEBUG] [org.gradle.cache.internal.btree.BTreePersistentIndexedCache] Closing cache module-metadata.bin (/home/phil/.gradle/caches/artifacts-8/module-metadata.bin)
15:28:40.591 [DEBUG] [org.gradle.cache.internal.btree.BTreePersistentIndexedCache] Closing cache dynamic-revisions.bin (/home/phil/.gradle/caches/artifacts-8/dynamic-revisions.bin)
15:28:40.591 [DEBUG] [org.gradle.cache.internal.DefaultFileLockManager] Releasing lock on artifact cache (/home/phil/.gradle/caches/artifacts-8).
15:28:40.592 [DEBUG] [org.gradle.api.internal.artifacts.ivyservice.IvyLoggingAdaper]    tried /home/phil/.m2/repository/org/apache/commons/com.springsource.org.apache.commons.httpclient/3.1.0/com.springsource.org.apache.commons.httpclient-3.1.0.pom
15:28:40.592 [DEBUG] [org.gradle.api.internal.artifacts.repositories.ResourceCollectionResolver] Loading /home/phil/.m2/repository/org/apache/commons/com.springsource.org.apache.commons.httpclient/3.1.0/com.springsource.org.apache.commons.httpclient-3.1.0.pom
15:28:40.593 [DEBUG] [org.gradle.api.internal.artifacts.repositories.ResourceCollectionResolver] Resource not reachable for org/apache/commons#com.springsource.org.apache.commons.httpclient;3.1.0: res=/home/phil/.m2/repository/org/apache/commons/com.springsource.org.apache.commons.httpclient/3.1.0/com.springsource.org.apache.commons.httpclient-3.1.0.pom
15:28:40.593 [DEBUG] [org.gradle.api.internal.artifacts.ivyservice.IvyLoggingAdaper]    tried /home/phil/.m2/repository/org/apache/commons/com.springsource.org.apache.commons.httpclient/3.1.0/com.springsource.org.apache.commons.httpclient-3.1.0.jar
15:28:40.593 [DEBUG] [org.gradle.api.internal.artifacts.repositories.ResourceCollectionResolver] Loading /home/phil/.m2/repository/org/apache/commons/com.springsource.org.apache.commons.httpclient/3.1.0/com.springsource.org.apache.commons.httpclient-3.1.0.jar
15:28:40.594 [DEBUG] [org.gradle.api.internal.artifacts.repositories.ResourceCollectionResolver] Resource not reachable for org/apache/commons#com.springsource.org.apache.commons.httpclient;3.1.0: res=/home/phil/.m2/repository/org/apache/commons/com.springsource.org.apache.commons.httpclient/3.1.0/com.springsource.org.apache.commons.httpclient-3.1.0.jar
15:28:40.594 [DEBUG] [org.gradle.api.internal.artifacts.ivyservice.IvyLoggingAdaper]  MavenLocal: no ivy file nor artifact found for org.apache.commons#com.springsource.org.apache.commons.httpclient;3.1.0
15:28:40.594 [DEBUG] [org.gradle.cache.internal.DefaultFileLockManager] Waiting to acquire exclusive lock on artifact cache (/home/phil/.gradle/caches/artifacts-8).
15:28:40.595 [DEBUG] [org.gradle.cache.internal.DefaultFileLockManager] Lock acquired.
15:28:40.595 [DEBUG] [org.gradle.cache.internal.btree.BTreePersistentIndexedCache] Opening cache dynamic-revisions.bin (/home/phil/.gradle/caches/artifacts-8/dynamic-revisions.bin)
15:28:40.596 [DEBUG] [org.gradle.cache.internal.btree.BTreePersistentIndexedCache] Opening cache module-metadata.bin (/home/phil/.gradle/caches/artifacts-8/module-metadata.bin)
15:28:40.597 [DEBUG] [org.gradle.api.internal.artifacts.ivyservice.IvyLoggingAdaper] post 1.3 ivy file: using exact as default matcher
15:28:40.598 [DEBUG] [org.gradle.api.internal.artifacts.ivyservice.ivyresolve.CachingModuleVersionRepository] Using cached module metadata for 'org.apache.commons#com.springsource.org.apache.commons.httpclient;3.1.0'
15:28:40.598 [DEBUG] [org.gradle.api.internal.artifacts.ivyservice.ivyresolve.UserResolverChain] Found module org.apache.commons#com.springsource.org.apache.commons.httpclient;3.1.0 using repository maven
15:28:40.598 [DEBUG] [org.gradle.api.internal.artifacts.ivyservice.resolveengine.DependencyGraphBuilder] Visiting configuration ros.rosjava_core#apache_xmlrpc_common;0.0.0-SNAPSHOT(master).
15:28:40.599 [DEBUG] [org.gradle.api.internal.artifacts.ivyservice.resolveengine.DependencyGraphBuilder] Visiting configuration ros.rosjava_core#rosjava_bootstrap;0.0.0-SNAPSHOT(compile).
15:28:40.599 [DEBUG] [org.gradle.api.internal.artifacts.ivyservice.resolveengine.DependencyGraphBuilder] Visiting dependency ros.rosjava_core#rosjava_bootstrap;0.0.0-SNAPSHOT(compile) -> com.google.guava#guava;r07([compile(*), master(*)])
15:28:40.599 [DEBUG] [org.gradle.api.internal.artifacts.ivyservice.resolveengine.DependencyGraphBuilder] Visiting dependency ros.rosjava_core#rosjava_bootstrap;0.0.0-SNAPSHOT(compile) -> org.apache.commons#com.springsource.org.apache.commons.lang;2.4.0([compile(*), master(*)])
15:28:40.600 [DEBUG] [org.gradle.api.internal.artifacts.ivyservice.resolveengine.DependencyGraphBuilder] Selecting new module version org.apache.commons#com.springsource.org.apache.commons.lang;2.4.0
15:28:40.600 [DEBUG] [org.gradle.cache.internal.btree.BTreePersistentIndexedCache] Closing cache module-metadata.bin (/home/phil/.gradle/caches/artifacts-8/module-metadata.bin)
15:28:40.601 [DEBUG] [org.gradle.cache.internal.btree.BTreePersistentIndexedCache] Closing cache dynamic-revisions.bin (/home/phil/.gradle/caches/artifacts-8/dynamic-revisions.bin)
15:28:40.601 [DEBUG] [org.gradle.cache.internal.DefaultFileLockManager] Releasing lock on artifact cache (/home/phil/.gradle/caches/artifacts-8).
15:28:40.601 [DEBUG] [org.gradle.api.internal.artifacts.ivyservice.IvyLoggingAdaper]    tried /home/phil/.m2/repository/org/apache/commons/com.springsource.org.apache.commons.lang/2.4.0/com.springsource.org.apache.commons.lang-2.4.0.pom
15:28:40.602 [DEBUG] [org.gradle.api.internal.artifacts.repositories.ResourceCollectionResolver] Loading /home/phil/.m2/repository/org/apache/commons/com.springsource.org.apache.commons.lang/2.4.0/com.springsource.org.apache.commons.lang-2.4.0.pom
15:28:40.602 [DEBUG] [org.gradle.api.internal.artifacts.repositories.ResourceCollectionResolver] Resource not reachable for org/apache/commons#com.springsource.org.apache.commons.lang;2.4.0: res=/home/phil/.m2/repository/org/apache/commons/com.springsource.org.apache.commons.lang/2.4.0/com.springsource.org.apache.commons.lang-2.4.0.pom
15:28:40.602 [DEBUG] [org.gradle.api.internal.artifacts.ivyservice.IvyLoggingAdaper]    tried /home/phil/.m2/repository/org/apache/commons/com.springsource.org.apache.commons.lang/2.4.0/com.springsource.org.apache.commons.lang-2.4.0.jar
15:28:40.603 [DEBUG] [org.gradle.api.internal.artifacts.repositories.ResourceCollectionResolver] Loading /home/phil/.m2/repository/org/apache/commons/com.springsource.org.apache.commons.lang/2.4.0/com.springsource.org.apache.commons.lang-2.4.0.jar
15:28:40.603 [DEBUG] [org.gradle.api.internal.artifacts.repositories.ResourceCollectionResolver] Resource not reachable for org/apache/commons#com.springsource.org.apache.commons.lang;2.4.0: res=/home/phil/.m2/repository/org/apache/commons/com.springsource.org.apache.commons.lang/2.4.0/com.springsource.org.apache.commons.lang-2.4.0.jar
15:28:40.604 [DEBUG] [org.gradle.api.internal.artifacts.ivyservice.IvyLoggingAdaper]  MavenLocal: no ivy file nor artifact found for org.apache.commons#com.springsource.org.apache.commons.lang;2.4.0
15:28:40.604 [DEBUG] [org.gradle.cache.internal.DefaultFileLockManager] Waiting to acquire exclusive lock on artifact cache (/home/phil/.gradle/caches/artifacts-8).
15:28:40.604 [DEBUG] [org.gradle.cache.internal.DefaultFileLockManager] Lock acquired.
15:28:40.605 [DEBUG] [org.gradle.cache.internal.btree.BTreePersistentIndexedCache] Opening cache dynamic-revisions.bin (/home/phil/.gradle/caches/artifacts-8/dynamic-revisions.bin)
15:28:40.605 [DEBUG] [org.gradle.cache.internal.btree.BTreePersistentIndexedCache] Opening cache module-metadata.bin (/home/phil/.gradle/caches/artifacts-8/module-metadata.bin)
15:28:40.606 [DEBUG] [org.gradle.api.internal.artifacts.ivyservice.IvyLoggingAdaper] post 1.3 ivy file: using exact as default matcher
15:28:40.607 [DEBUG] [org.gradle.api.internal.artifacts.ivyservice.ivyresolve.CachingModuleVersionRepository] Using cached module metadata for 'org.apache.commons#com.springsource.org.apache.commons.lang;2.4.0'
15:28:40.608 [DEBUG] [org.gradle.api.internal.artifacts.ivyservice.ivyresolve.UserResolverChain] Found module org.apache.commons#com.springsource.org.apache.commons.lang;2.4.0 using repository maven
15:28:40.608 [DEBUG] [org.gradle.api.internal.artifacts.ivyservice.resolveengine.DependencyGraphBuilder] Visiting dependency ros.rosjava_core#rosjava_bootstrap;0.0.0-SNAPSHOT(compile) -> org.apache.commons#com.springsource.org.apache.commons.codec;1.3.0([compile(*), master(*)])
15:28:40.608 [DEBUG] [org.gradle.api.internal.artifacts.ivyservice.resolveengine.DependencyGraphBuilder] Selecting new module version org.apache.commons#com.springsource.org.apache.commons.codec;1.3.0
15:28:40.609 [DEBUG] [org.gradle.cache.internal.btree.BTreePersistentIndexedCache] Closing cache module-metadata.bin (/home/phil/.gradle/caches/artifacts-8/module-metadata.bin)
15:28:40.609 [DEBUG] [org.gradle.cache.internal.btree.BTreePersistentIndexedCache] Closing cache dynamic-revisions.bin (/home/phil/.gradle/caches/artifacts-8/dynamic-revisions.bin)
15:28:40.609 [DEBUG] [org.gradle.cache.internal.DefaultFileLockManager] Releasing lock on artifact cache (/home/phil/.gradle/caches/artifacts-8).
15:28:40.610 [DEBUG] [org.gradle.api.internal.artifacts.ivyservice.IvyLoggingAdaper]    tried /home/phil/.m2/repository/org/apache/commons/com.springsource.org.apache.commons.codec/1.3.0/com.springsource.org.apache.commons.codec-1.3.0.pom
15:28:40.610 [DEBUG] [org.gradle.api.internal.artifacts.repositories.ResourceCollectionResolver] Loading /home/phil/.m2/repository/org/apache/commons/com.springsource.org.apache.commons.codec/1.3.0/com.springsource.org.apache.commons.codec-1.3.0.pom
15:28:40.611 [DEBUG] [org.gradle.api.internal.artifacts.repositories.ResourceCollectionResolver] Resource not reachable for org/apache/commons#com.springsource.org.apache.commons.codec;1.3.0: res=/home/phil/.m2/repository/org/apache/commons/com.springsource.org.apache.commons.codec/1.3.0/com.springsource.org.apache.commons.codec-1.3.0.pom
15:28:40.611 [DEBUG] [org.gradle.api.internal.artifacts.ivyservice.IvyLoggingAdaper]    tried /home/phil/.m2/repository/org/apache/commons/com.springsource.org.apache.commons.codec/1.3.0/com.springsource.org.apache.commons.codec-1.3.0.jar
15:28:40.612 [DEBUG] [org.gradle.api.internal.artifacts.repositories.ResourceCollectionResolver] Loading /home/phil/.m2/repository/org/apache/commons/com.springsource.org.apache.commons.codec/1.3.0/com.springsource.org.apache.commons.codec-1.3.0.jar
15:28:40.612 [DEBUG] [org.gradle.api.internal.artifacts.repositories.ResourceCollectionResolver] Resource not reachable for org/apache/commons#com.springsource.org.apache.commons.codec;1.3.0: res=/home/phil/.m2/repository/org/apache/commons/com.springsource.org.apache.commons.codec/1.3.0/com.springsource.org.apache.commons.codec-1.3.0.jar
15:28:40.613 [DEBUG] [org.gradle.api.internal.artifacts.ivyservice.IvyLoggingAdaper]  MavenLocal: no ivy file nor artifact found for org.apache.commons#com.springsource.org.apache.commons.codec;1.3.0
15:28:40.613 [DEBUG] [org.gradle.cache.internal.DefaultFileLockManager] Waiting to acquire exclusive lock on artifact cache (/home/phil/.gradle/caches/artifacts-8).
15:28:40.614 [DEBUG] [org.gradle.cache.internal.DefaultFileLockManager] Lock acquired.
15:28:40.614 [DEBUG] [org.gradle.cache.internal.btree.BTreePersistentIndexedCache] Opening cache dynamic-revisions.bin (/home/phil/.gradle/caches/artifacts-8/dynamic-revisions.bin)
15:28:40.615 [DEBUG] [org.gradle.cache.internal.btree.BTreePersistentIndexedCache] Opening cache module-metadata.bin (/home/phil/.gradle/caches/artifacts-8/module-metadata.bin)
15:28:40.616 [DEBUG] [org.gradle.api.internal.artifacts.ivyservice.IvyLoggingAdaper] post 1.3 ivy file: using exact as default matcher
15:28:40.617 [DEBUG] [org.gradle.api.internal.artifacts.ivyservice.ivyresolve.CachingModuleVersionRepository] Using cached module metadata for 'org.apache.commons#com.springsource.org.apache.commons.codec;1.3.0'
15:28:40.617 [DEBUG] [org.gradle.api.internal.artifacts.ivyservice.ivyresolve.UserResolverChain] Found module org.apache.commons#com.springsource.org.apache.commons.codec;1.3.0 using repository maven
15:28:40.618 [DEBUG] [org.gradle.api.internal.artifacts.ivyservice.resolveengine.DependencyGraphBuilder] Visiting dependency ros.rosjava_core#rosjava_bootstrap;0.0.0-SNAPSHOT(compile) -> org.apache.commons#com.springsource.org.apache.commons.io;1.4.0([compile(*), master(*)])
15:28:40.618 [DEBUG] [org.gradle.api.internal.artifacts.ivyservice.resolveengine.DependencyGraphBuilder] Selecting new module version org.apache.commons#com.springsource.org.apache.commons.io;1.4.0
15:28:40.619 [DEBUG] [org.gradle.cache.internal.btree.BTreePersistentIndexedCache] Closing cache module-metadata.bin (/home/phil/.gradle/caches/artifacts-8/module-metadata.bin)
15:28:40.619 [DEBUG] [org.gradle.cache.internal.btree.BTreePersistentIndexedCache] Closing cache dynamic-revisions.bin (/home/phil/.gradle/caches/artifacts-8/dynamic-revisions.bin)
15:28:40.619 [DEBUG] [org.gradle.cache.internal.DefaultFileLockManager] Releasing lock on artifact cache (/home/phil/.gradle/caches/artifacts-8).
15:28:40.620 [DEBUG] [org.gradle.api.internal.artifacts.ivyservice.IvyLoggingAdaper]    tried /home/phil/.m2/repository/org/apache/commons/com.springsource.org.apache.commons.io/1.4.0/com.springsource.org.apache.commons.io-1.4.0.pom
15:28:40.620 [DEBUG] [org.gradle.api.internal.artifacts.repositories.ResourceCollectionResolver] Loading /home/phil/.m2/repository/org/apache/commons/com.springsource.org.apache.commons.io/1.4.0/com.springsource.org.apache.commons.io-1.4.0.pom
15:28:40.621 [DEBUG] [org.gradle.api.internal.artifacts.repositories.ResourceCollectionResolver] Resource not reachable for org/apache/commons#com.springsource.org.apache.commons.io;1.4.0: res=/home/phil/.m2/repository/org/apache/commons/com.springsource.org.apache.commons.io/1.4.0/com.springsource.org.apache.commons.io-1.4.0.pom
15:28:40.621 [DEBUG] [org.gradle.api.internal.artifacts.ivyservice.IvyLoggingAdaper]    tried /home/phil/.m2/repository/org/apache/commons/com.springsource.org.apache.commons.io/1.4.0/com.springsource.org.apache.commons.io-1.4.0.jar
15:28:40.621 [DEBUG] [org.gradle.api.internal.artifacts.repositories.ResourceCollectionResolver] Loading /home/phil/.m2/repository/org/apache/commons/com.springsource.org.apache.commons.io/1.4.0/com.springsource.org.apache.commons.io-1.4.0.jar
15:28:40.622 [DEBUG] [org.gradle.api.internal.artifacts.repositories.ResourceCollectionResolver] Resource not reachable for org/apache/commons#com.springsource.org.apache.commons.io;1.4.0: res=/home/phil/.m2/repository/org/apache/commons/com.springsource.org.apache.commons.io/1.4.0/com.springsource.org.apache.commons.io-1.4.0.jar
15:28:40.622 [DEBUG] [org.gradle.api.internal.artifacts.ivyservice.IvyLoggingAdaper]  MavenLocal: no ivy file nor artifact found for org.apache.commons#com.springsource.org.apache.commons.io;1.4.0
15:28:40.623 [DEBUG] [org.gradle.cache.internal.DefaultFileLockManager] Waiting to acquire exclusive lock on artifact cache (/home/phil/.gradle/caches/artifacts-8).
15:28:40.623 [DEBUG] [org.gradle.cache.internal.DefaultFileLockManager] Lock acquired.
15:28:40.624 [DEBUG] [org.gradle.cache.internal.btree.BTreePersistentIndexedCache] Opening cache dynamic-revisions.bin (/home/phil/.gradle/caches/artifacts-8/dynamic-revisions.bin)
15:28:40.624 [DEBUG] [org.gradle.cache.internal.btree.BTreePersistentIndexedCache] Opening cache module-metadata.bin (/home/phil/.gradle/caches/artifacts-8/module-metadata.bin)
15:28:40.625 [DEBUG] [org.gradle.api.internal.artifacts.ivyservice.IvyLoggingAdaper] post 1.3 ivy file: using exact as default matcher
15:28:40.626 [DEBUG] [org.gradle.api.internal.artifacts.ivyservice.ivyresolve.CachingModuleVersionRepository] Using cached module metadata for 'org.apache.commons#com.springsource.org.apache.commons.io;1.4.0'
15:28:40.626 [DEBUG] [org.gradle.api.internal.artifacts.ivyservice.ivyresolve.UserResolverChain] Found module org.apache.commons#com.springsource.org.apache.commons.io;1.4.0 using repository maven
15:28:40.627 [DEBUG] [org.gradle.api.internal.artifacts.ivyservice.resolveengine.DependencyGraphBuilder] Visiting configuration ros.rosjava_core#rosjava_bootstrap;0.0.0-SNAPSHOT(master).
15:28:40.627 [DEBUG] [org.gradle.api.internal.artifacts.ivyservice.resolveengine.DependencyGraphBuilder] Visiting configuration ros.rosjava_core#apache_xmlrpc_server;0.0.0-SNAPSHOT(compile).
15:28:40.628 [DEBUG] [org.gradle.api.internal.artifacts.ivyservice.resolveengine.DependencyGraphBuilder] Visiting dependency ros.rosjava_core#apache_xmlrpc_server;0.0.0-SNAPSHOT(compile) -> org.apache.commons#com.springsource.org.apache.commons.logging;1.1.1([compile(*), master(*)])
15:28:40.628 [DEBUG] [org.gradle.api.internal.artifacts.ivyservice.resolveengine.DependencyGraphBuilder] Visiting dependency ros.rosjava_core#apache_xmlrpc_server;0.0.0-SNAPSHOT(compile) -> ros.rosjava_core#apache_xmlrpc_common;0.0.0-SNAPSHOT([compile(*), master(*)])
15:28:40.628 [DEBUG] [org.gradle.api.internal.artifacts.ivyservice.resolveengine.DependencyGraphBuilder] Visiting configuration ros.rosjava_core#apache_xmlrpc_server;0.0.0-SNAPSHOT(master).
15:28:40.629 [DEBUG] [org.gradle.api.internal.artifacts.ivyservice.resolveengine.DependencyGraphBuilder] Visiting configuration dnsjava#dnsjava;2.1.1(compile).
15:28:40.629 [DEBUG] [org.gradle.api.internal.artifacts.ivyservice.resolveengine.DependencyGraphBuilder] junit#junit is excluded from dnsjava#dnsjava;2.1.1(compile).
15:28:40.629 [DEBUG] [org.gradle.api.internal.artifacts.ivyservice.resolveengine.DependencyGraphBuilder] Visiting configuration dnsjava#dnsjava;2.1.1(master).
15:28:40.630 [DEBUG] [org.gradle.api.internal.artifacts.ivyservice.resolveengine.DependencyGraphBuilder] Visiting configuration org.jboss.netty#netty;3.2.4.Final(runtime).
15:28:40.630 [DEBUG] [org.gradle.api.internal.artifacts.ivyservice.resolveengine.DependencyGraphBuilder] Visiting configuration com.google.guava#guava;r07(runtime).
15:28:40.630 [DEBUG] [org.gradle.api.internal.artifacts.ivyservice.resolveengine.DependencyGraphBuilder] Visiting configuration org.apache.commons#com.springsource.org.apache.commons.net;2.0.0(runtime).
15:28:40.631 [DEBUG] [org.gradle.api.internal.artifacts.ivyservice.resolveengine.DependencyGraphBuilder] Visiting configuration org.apache.commons#com.springsource.org.apache.commons.logging;1.1.1(runtime).
15:28:40.631 [DEBUG] [org.gradle.api.internal.artifacts.ivyservice.resolveengine.DependencyGraphBuilder] Visiting configuration ros.rosjava_core#rosjava_messages;0.0.0-SNAPSHOT(runtime).
15:28:40.631 [DEBUG] [org.gradle.api.internal.artifacts.ivyservice.resolveengine.DependencyGraphBuilder] Visiting dependency ros.rosjava_core#rosjava_messages;0.0.0-SNAPSHOT(runtime) -> ros.rosjava_core#rosjava_bootstrap;0.0.0-SNAPSHOT([compile(*), master(*), runtime(*)])
15:28:40.632 [DEBUG] [org.gradle.api.internal.artifacts.ivyservice.resolveengine.DependencyGraphBuilder] Visiting configuration ros.rosjava_core#apache_xmlrpc_client;0.0.0-SNAPSHOT(runtime).
15:28:40.632 [DEBUG] [org.gradle.api.internal.artifacts.ivyservice.resolveengine.DependencyGraphBuilder] Visiting dependency ros.rosjava_core#apache_xmlrpc_client;0.0.0-SNAPSHOT(runtime) -> org.apache.ws.commons#ws-commons-util;1.0.1([compile(*), master(*), runtime(*)])
15:28:40.632 [DEBUG] [org.gradle.api.internal.artifacts.ivyservice.resolveengine.DependencyGraphBuilder] Visiting dependency ros.rosjava_core#apache_xmlrpc_client;0.0.0-SNAPSHOT(runtime) -> ros.rosjava_core#apache_xmlrpc_common;0.0.0-SNAPSHOT([compile(*), master(*), runtime(*)])
15:28:40.633 [DEBUG] [org.gradle.api.internal.artifacts.ivyservice.resolveengine.DependencyGraphBuilder] Visiting configuration ros.rosjava_core#apache_xmlrpc_common;0.0.0-SNAPSHOT(runtime).
15:28:40.633 [DEBUG] [org.gradle.api.internal.artifacts.ivyservice.resolveengine.DependencyGraphBuilder] Visiting dependency ros.rosjava_core#apache_xmlrpc_common;0.0.0-SNAPSHOT(runtime) -> org.apache.ws.commons#ws-commons-util;1.0.1([compile(*), master(*), runtime(*)])
15:28:40.633 [DEBUG] [org.gradle.api.internal.artifacts.ivyservice.resolveengine.DependencyGraphBuilder] Visiting dependency ros.rosjava_core#apache_xmlrpc_common;0.0.0-SNAPSHOT(runtime) -> org.apache.commons#com.springsource.org.apache.commons.httpclient;3.1.0([compile(*), master(*), runtime(*)])
15:28:40.634 [DEBUG] [org.gradle.api.internal.artifacts.ivyservice.resolveengine.DependencyGraphBuilder] Visiting configuration ros.rosjava_core#rosjava_bootstrap;0.0.0-SNAPSHOT(runtime).
15:28:40.634 [DEBUG] [org.gradle.api.internal.artifacts.ivyservice.resolveengine.DependencyGraphBuilder] Visiting dependency ros.rosjava_core#rosjava_bootstrap;0.0.0-SNAPSHOT(runtime) -> com.google.guava#guava;r07([compile(*), master(*), runtime(*)])
15:28:40.634 [DEBUG] [org.gradle.api.internal.artifacts.ivyservice.resolveengine.DependencyGraphBuilder] Visiting dependency ros.rosjava_core#rosjava_bootstrap;0.0.0-SNAPSHOT(runtime) -> org.apache.commons#com.springsource.org.apache.commons.lang;2.4.0([compile(*), master(*), runtime(*)])
15:28:40.635 [DEBUG] [org.gradle.api.internal.artifacts.ivyservice.resolveengine.DependencyGraphBuilder] Visiting dependency ros.rosjava_core#rosjava_bootstrap;0.0.0-SNAPSHOT(runtime) -> org.apache.commons#com.springsource.org.apache.commons.codec;1.3.0([compile(*), master(*), runtime(*)])
15:28:40.635 [DEBUG] [org.gradle.api.internal.artifacts.ivyservice.resolveengine.DependencyGraphBuilder] Visiting dependency ros.rosjava_core#rosjava_bootstrap;0.0.0-SNAPSHOT(runtime) -> org.apache.commons#com.springsource.org.apache.commons.io;1.4.0([compile(*), master(*), runtime(*)])
15:28:40.635 [DEBUG] [org.gradle.api.internal.artifacts.ivyservice.resolveengine.DependencyGraphBuilder] Visiting configuration ros.rosjava_core#apache_xmlrpc_server;0.0.0-SNAPSHOT(runtime).
15:28:40.636 [DEBUG] [org.gradle.api.internal.artifacts.ivyservice.resolveengine.DependencyGraphBuilder] Visiting dependency ros.rosjava_core#apache_xmlrpc_server;0.0.0-SNAPSHOT(runtime) -> org.apache.commons#com.springsource.org.apache.commons.logging;1.1.1([compile(*), master(*), runtime(*)])
15:28:40.636 [DEBUG] [org.gradle.api.internal.artifacts.ivyservice.resolveengine.DependencyGraphBuilder] Visiting dependency ros.rosjava_core#apache_xmlrpc_server;0.0.0-SNAPSHOT(runtime) -> ros.rosjava_core#apache_xmlrpc_common;0.0.0-SNAPSHOT([compile(*), master(*), runtime(*)])
15:28:40.637 [DEBUG] [org.gradle.api.internal.artifacts.ivyservice.resolveengine.DependencyGraphBuilder] Visiting configuration dnsjava#dnsjava;2.1.1(runtime).
15:28:40.637 [DEBUG] [org.gradle.api.internal.artifacts.ivyservice.resolveengine.DependencyGraphBuilder] junit#junit is excluded from dnsjava#dnsjava;2.1.1(runtime).
15:28:40.637 [DEBUG] [org.gradle.api.internal.artifacts.ivyservice.resolveengine.DependencyGraphBuilder] Visiting configuration org.apache.ws.commons#ws-commons-util;1.0.1(compile).
15:28:40.637 [DEBUG] [org.gradle.api.internal.artifacts.ivyservice.resolveengine.DependencyGraphBuilder] junit#junit is excluded from org.apache.ws.commons#ws-commons-util;1.0.1(compile).
15:28:40.638 [DEBUG] [org.gradle.api.internal.artifacts.ivyservice.resolveengine.DependencyGraphBuilder] xml-apis#xml-apis is excluded from org.apache.ws.commons#ws-commons-util;1.0.1(compile).
15:28:40.638 [DEBUG] [org.gradle.api.internal.artifacts.ivyservice.resolveengine.DependencyGraphBuilder] Visiting configuration org.apache.ws.commons#ws-commons-util;1.0.1(master).
15:28:40.638 [DEBUG] [org.gradle.api.internal.artifacts.ivyservice.resolveengine.DependencyGraphBuilder] Visiting configuration org.apache.commons#com.springsource.org.apache.commons.httpclient;3.1.0(compile).
15:28:40.639 [DEBUG] [org.gradle.api.internal.artifacts.ivyservice.resolveengine.DependencyGraphBuilder] Visiting dependency org.apache.commons#com.springsource.org.apache.commons.httpclient;3.1.0(compile) -> org.apache.commons#com.springsource.org.apache.commons.codec;1.3.0([compile(*), master(*)])
15:28:40.639 [DEBUG] [org.gradle.api.internal.artifacts.ivyservice.resolveengine.DependencyGraphBuilder] Visiting dependency org.apache.commons#com.springsource.org.apache.commons.httpclient;3.1.0(compile) -> org.apache.commons#com.springsource.org.apache.commons.logging;1.1.1([compile(*), master(*)])
15:28:40.639 [DEBUG] [org.gradle.api.internal.artifacts.ivyservice.resolveengine.DependencyGraphBuilder] Visiting configuration org.apache.commons#com.springsource.org.apache.commons.httpclient;3.1.0(master).
15:28:40.640 [DEBUG] [org.gradle.api.internal.artifacts.ivyservice.resolveengine.DependencyGraphBuilder] Visiting configuration com.google.guava#guava;r07(compile).
15:28:40.640 [DEBUG] [org.gradle.api.internal.artifacts.ivyservice.resolveengine.DependencyGraphBuilder] Changed edges for com.google.guava#guava;r07(compile) selects same versions as previous traversal. ignoring
15:28:40.640 [DEBUG] [org.gradle.api.internal.artifacts.ivyservice.resolveengine.DependencyGraphBuilder] Visiting configuration com.google.guava#guava;r07(master).
15:28:40.641 [DEBUG] [org.gradle.api.internal.artifacts.ivyservice.resolveengine.DependencyGraphBuilder] Changed edges for com.google.guava#guava;r07(master) selects same versions as previous traversal. ignoring
15:28:40.641 [DEBUG] [org.gradle.api.internal.artifacts.ivyservice.resolveengine.DependencyGraphBuilder] Visiting configuration org.apache.commons#com.springsource.org.apache.commons.lang;2.4.0(compile).
15:28:40.641 [DEBUG] [org.gradle.api.internal.artifacts.ivyservice.resolveengine.DependencyGraphBuilder] Visiting configuration org.apache.commons#com.springsource.org.apache.commons.lang;2.4.0(master).
15:28:40.642 [DEBUG] [org.gradle.api.internal.artifacts.ivyservice.resolveengine.DependencyGraphBuilder] Visiting configuration org.apache.commons#com.springsource.org.apache.commons.codec;1.3.0(compile).
15:28:40.642 [DEBUG] [org.gradle.api.internal.artifacts.ivyservice.resolveengine.DependencyGraphBuilder] Visiting configuration org.apache.commons#com.springsource.org.apache.commons.codec;1.3.0(master).
15:28:40.642 [DEBUG] [org.gradle.api.internal.artifacts.ivyservice.resolveengine.DependencyGraphBuilder] Visiting configuration org.apache.commons#com.springsource.org.apache.commons.io;1.4.0(compile).
15:28:40.643 [DEBUG] [org.gradle.api.internal.artifacts.ivyservice.resolveengine.DependencyGraphBuilder] Visiting configuration org.apache.commons#com.springsource.org.apache.commons.io;1.4.0(master).
15:28:40.643 [DEBUG] [org.gradle.api.internal.artifacts.ivyservice.resolveengine.DependencyGraphBuilder] Visiting configuration org.apache.commons#com.springsource.org.apache.commons.logging;1.1.1(compile).
15:28:40.643 [DEBUG] [org.gradle.api.internal.artifacts.ivyservice.resolveengine.DependencyGraphBuilder] Changed edges for org.apache.commons#com.springsource.org.apache.commons.logging;1.1.1(compile) selects same versions as previous traversal. ignoring
15:28:40.644 [DEBUG] [org.gradle.api.internal.artifacts.ivyservice.resolveengine.DependencyGraphBuilder] Visiting configuration org.apache.commons#com.springsource.org.apache.commons.logging;1.1.1(master).
15:28:40.644 [DEBUG] [org.gradle.api.internal.artifacts.ivyservice.resolveengine.DependencyGraphBuilder] Changed edges for org.apache.commons#com.springsource.org.apache.commons.logging;1.1.1(master) selects same versions as previous traversal. ignoring
15:28:40.644 [DEBUG] [org.gradle.api.internal.artifacts.ivyservice.resolveengine.DependencyGraphBuilder] Visiting configuration ros.rosjava_core#apache_xmlrpc_common;0.0.0-SNAPSHOT(compile).
15:28:40.645 [DEBUG] [org.gradle.api.internal.artifacts.ivyservice.resolveengine.DependencyGraphBuilder] Changed edges for ros.rosjava_core#apache_xmlrpc_common;0.0.0-SNAPSHOT(compile) selects same versions as previous traversal. ignoring
15:28:40.645 [DEBUG] [org.gradle.api.internal.artifacts.ivyservice.resolveengine.DependencyGraphBuilder] Visiting configuration ros.rosjava_core#apache_xmlrpc_common;0.0.0-SNAPSHOT(master).
15:28:40.646 [DEBUG] [org.gradle.api.internal.artifacts.ivyservice.resolveengine.DependencyGraphBuilder] Changed edges for ros.rosjava_core#apache_xmlrpc_common;0.0.0-SNAPSHOT(master) selects same versions as previous traversal. ignoring
15:28:40.646 [DEBUG] [org.gradle.api.internal.artifacts.ivyservice.resolveengine.DependencyGraphBuilder] Visiting configuration ros.rosjava_core#rosjava_bootstrap;0.0.0-SNAPSHOT(compile).
15:28:40.646 [DEBUG] [org.gradle.api.internal.artifacts.ivyservice.resolveengine.DependencyGraphBuilder] Changed edges for ros.rosjava_core#rosjava_bootstrap;0.0.0-SNAPSHOT(compile) selects same versions as previous traversal. ignoring
15:28:40.646 [DEBUG] [org.gradle.api.internal.artifacts.ivyservice.resolveengine.DependencyGraphBuilder] Visiting configuration ros.rosjava_core#rosjava_bootstrap;0.0.0-SNAPSHOT(master).
15:28:40.647 [DEBUG] [org.gradle.api.internal.artifacts.ivyservice.resolveengine.DependencyGraphBuilder] Changed edges for ros.rosjava_core#rosjava_bootstrap;0.0.0-SNAPSHOT(master) selects same versions as previous traversal. ignoring
15:28:40.647 [DEBUG] [org.gradle.api.internal.artifacts.ivyservice.resolveengine.DependencyGraphBuilder] Visiting configuration org.apache.ws.commons#ws-commons-util;1.0.1(runtime).
15:28:40.647 [DEBUG] [org.gradle.api.internal.artifacts.ivyservice.resolveengine.DependencyGraphBuilder] junit#junit is excluded from org.apache.ws.commons#ws-commons-util;1.0.1(runtime).
15:28:40.648 [DEBUG] [org.gradle.api.internal.artifacts.ivyservice.resolveengine.DependencyGraphBuilder] xml-apis#xml-apis is excluded from org.apache.ws.commons#ws-commons-util;1.0.1(runtime).
15:28:40.648 [DEBUG] [org.gradle.api.internal.artifacts.ivyservice.resolveengine.DependencyGraphBuilder] Visiting configuration org.apache.commons#com.springsource.org.apache.commons.httpclient;3.1.0(runtime).
15:28:40.648 [DEBUG] [org.gradle.api.internal.artifacts.ivyservice.resolveengine.DependencyGraphBuilder] Visiting dependency org.apache.commons#com.springsource.org.apache.commons.httpclient;3.1.0(runtime) -> org.apache.commons#com.springsource.org.apache.commons.codec;1.3.0([compile(*), master(*), runtime(*)])
15:28:40.649 [DEBUG] [org.gradle.api.internal.artifacts.ivyservice.resolveengine.DependencyGraphBuilder] Visiting dependency org.apache.commons#com.springsource.org.apache.commons.httpclient;3.1.0(runtime) -> org.apache.commons#com.springsource.org.apache.commons.logging;1.1.1([compile(*), master(*), runtime(*)])
15:28:40.649 [DEBUG] [org.gradle.api.internal.artifacts.ivyservice.resolveengine.DependencyGraphBuilder] Visiting configuration com.google.guava#guava;r07(runtime).
15:28:40.650 [DEBUG] [org.gradle.api.internal.artifacts.ivyservice.resolveengine.DependencyGraphBuilder] Changed edges for com.google.guava#guava;r07(runtime) selects same versions as previous traversal. ignoring
15:28:40.650 [DEBUG] [org.gradle.api.internal.artifacts.ivyservice.resolveengine.DependencyGraphBuilder] Visiting configuration org.apache.commons#com.springsource.org.apache.commons.lang;2.4.0(runtime).
15:28:40.650 [DEBUG] [org.gradle.api.internal.artifacts.ivyservice.resolveengine.DependencyGraphBuilder] Visiting configuration org.apache.commons#com.springsource.org.apache.commons.codec;1.3.0(runtime).
15:28:40.651 [DEBUG] [org.gradle.api.internal.artifacts.ivyservice.resolveengine.DependencyGraphBuilder] Visiting configuration org.apache.commons#com.springsource.org.apache.commons.io;1.4.0(runtime).
15:28:40.651 [DEBUG] [org.gradle.api.internal.artifacts.ivyservice.resolveengine.DependencyGraphBuilder] Visiting configuration org.apache.commons#com.springsource.org.apache.commons.logging;1.1.1(runtime).
15:28:40.651 [DEBUG] [org.gradle.api.internal.artifacts.ivyservice.resolveengine.DependencyGraphBuilder] Changed edges for org.apache.commons#com.springsource.org.apache.commons.logging;1.1.1(runtime) selects same versions as previous traversal. ignoring
15:28:40.652 [DEBUG] [org.gradle.api.internal.artifacts.ivyservice.resolveengine.DependencyGraphBuilder] Visiting configuration ros.rosjava_core#apache_xmlrpc_common;0.0.0-SNAPSHOT(runtime).
15:28:40.652 [DEBUG] [org.gradle.api.internal.artifacts.ivyservice.resolveengine.DependencyGraphBuilder] Changed edges for ros.rosjava_core#apache_xmlrpc_common;0.0.0-SNAPSHOT(runtime) selects same versions as previous traversal. ignoring
15:28:40.652 [DEBUG] [org.gradle.api.internal.artifacts.ivyservice.resolveengine.DependencyGraphBuilder] Visiting configuration org.apache.commons#com.springsource.org.apache.commons.codec;1.3.0(compile).
15:28:40.653 [DEBUG] [org.gradle.api.internal.artifacts.ivyservice.resolveengine.DependencyGraphBuilder] Changed edges for org.apache.commons#com.springsource.org.apache.commons.codec;1.3.0(compile) selects same versions as previous traversal. ignoring
15:28:40.653 [DEBUG] [org.gradle.api.internal.artifacts.ivyservice.resolveengine.DependencyGraphBuilder] Visiting configuration org.apache.commons#com.springsource.org.apache.commons.codec;1.3.0(master).
15:28:40.653 [DEBUG] [org.gradle.api.internal.artifacts.ivyservice.resolveengine.DependencyGraphBuilder] Changed edges for org.apache.commons#com.springsource.org.apache.commons.codec;1.3.0(master) selects same versions as previous traversal. ignoring
15:28:40.654 [DEBUG] [org.gradle.api.internal.artifacts.ivyservice.resolveengine.DependencyGraphBuilder] Visiting configuration org.apache.commons#com.springsource.org.apache.commons.logging;1.1.1(compile).
15:28:40.654 [DEBUG] [org.gradle.api.internal.artifacts.ivyservice.resolveengine.DependencyGraphBuilder] Changed edges for org.apache.commons#com.springsource.org.apache.commons.logging;1.1.1(compile) selects same versions as previous traversal. ignoring
15:28:40.654 [DEBUG] [org.gradle.api.internal.artifacts.ivyservice.resolveengine.DependencyGraphBuilder] Visiting configuration org.apache.commons#com.springsource.org.apache.commons.logging;1.1.1(master).
15:28:40.655 [DEBUG] [org.gradle.api.internal.artifacts.ivyservice.resolveengine.DependencyGraphBuilder] Changed edges for org.apache.commons#com.springsource.org.apache.commons.logging;1.1.1(master) selects same versions as previous traversal. ignoring
15:28:40.655 [DEBUG] [org.gradle.api.internal.artifacts.ivyservice.resolveengine.DependencyGraphBuilder] Attaching ros.android_core#android_honeycomb_mr2;0.0.0-SNAPSHOT(compile) to its parents.
15:28:40.655 [DEBUG] [org.gradle.api.internal.artifacts.ivyservice.resolveengine.DependencyGraphBuilder] Attaching ros.rosjava_core#rosjava_geometry;0.0.0-SNAPSHOT(compile) to its parents.
15:28:40.656 [DEBUG] [org.gradle.api.internal.artifacts.ivyservice.resolveengine.DependencyGraphBuilder] Attaching ros.rosjava_core#rosjava_geometry;0.0.0-SNAPSHOT(runtime) to its parents.
15:28:40.656 [DEBUG] [org.gradle.api.internal.artifacts.ivyservice.resolveengine.DependencyGraphBuilder] Attaching ros.rosjava_core#rosjava_geometry;0.0.0-SNAPSHOT(master) to its parents.
15:28:40.656 [DEBUG] [org.gradle.api.internal.artifacts.ivyservice.resolveengine.DependencyGraphBuilder] Attaching ros.rosjava_core#rosjava_geometry;0.0.0-SNAPSHOT(default) to its parents.
15:28:40.657 [DEBUG] [org.gradle.api.internal.artifacts.ivyservice.resolveengine.DependencyGraphBuilder] Attaching ros.rosjava_core#rosjava;0.0.0-SNAPSHOT(compile) to its parents.
15:28:40.657 [DEBUG] [org.gradle.api.internal.artifacts.ivyservice.resolveengine.DependencyGraphBuilder] Attaching ros.rosjava_core#rosjava;0.0.0-SNAPSHOT(master) to its parents.
15:28:40.657 [DEBUG] [org.gradle.api.internal.artifacts.ivyservice.resolveengine.DependencyGraphBuilder] Attaching ros.rosjava_core#rosjava;0.0.0-SNAPSHOT(runtime) to its parents.
15:28:40.658 [DEBUG] [org.gradle.api.internal.artifacts.ivyservice.resolveengine.DependencyGraphBuilder] Attaching org.jboss.netty#netty;3.2.4.Final(compile) to its parents.
15:28:40.658 [DEBUG] [org.gradle.api.internal.artifacts.ivyservice.resolveengine.DependencyGraphBuilder] Attaching org.jboss.netty#netty;3.2.4.Final(master) to its parents.
15:28:40.658 [DEBUG] [org.gradle.api.internal.artifacts.ivyservice.resolveengine.DependencyGraphBuilder] Attaching com.google.guava#guava;r07(compile) to its parents.
15:28:40.659 [DEBUG] [org.gradle.api.internal.artifacts.ivyservice.resolveengine.DependencyGraphBuilder] Attaching com.google.guava#guava;r07(master) to its parents.
15:28:40.659 [DEBUG] [org.gradle.api.internal.artifacts.ivyservice.resolveengine.DependencyGraphBuilder] Attaching org.apache.commons#com.springsource.org.apache.commons.net;2.0.0(compile) to its parents.
15:28:40.659 [DEBUG] [org.gradle.api.internal.artifacts.ivyservice.resolveengine.DependencyGraphBuilder] Attaching org.apache.commons#com.springsource.org.apache.commons.net;2.0.0(master) to its parents.
15:28:40.660 [DEBUG] [org.gradle.api.internal.artifacts.ivyservice.resolveengine.DependencyGraphBuilder] Attaching org.apache.commons#com.springsource.org.apache.commons.logging;1.1.1(compile) to its parents.
15:28:40.660 [DEBUG] [org.gradle.api.internal.artifacts.ivyservice.resolveengine.DependencyGraphBuilder] Attaching org.apache.commons#com.springsource.org.apache.commons.logging;1.1.1(master) to its parents.
15:28:40.661 [DEBUG] [org.gradle.api.internal.artifacts.ivyservice.resolveengine.DependencyGraphBuilder] Attaching ros.rosjava_core#rosjava_messages;0.0.0-SNAPSHOT(compile) to its parents.
15:28:40.661 [DEBUG] [org.gradle.api.internal.artifacts.ivyservice.resolveengine.DependencyGraphBuilder] Attaching ros.rosjava_core#rosjava_messages;0.0.0-SNAPSHOT(master) to its parents.
15:28:40.661 [DEBUG] [org.gradle.api.internal.artifacts.ivyservice.resolveengine.DependencyGraphBuilder] Attaching ros.rosjava_core#apache_xmlrpc_client;0.0.0-SNAPSHOT(compile) to its parents.
15:28:40.662 [DEBUG] [org.gradle.api.internal.artifacts.ivyservice.resolveengine.DependencyGraphBuilder] Attaching ros.rosjava_core#apache_xmlrpc_client;0.0.0-SNAPSHOT(master) to its parents.
15:28:40.662 [DEBUG] [org.gradle.api.internal.artifacts.ivyservice.resolveengine.DependencyGraphBuilder] Attaching ros.rosjava_core#apache_xmlrpc_common;0.0.0-SNAPSHOT(compile) to its parents.
15:28:40.662 [DEBUG] [org.gradle.api.internal.artifacts.ivyservice.resolveengine.DependencyGraphBuilder] Attaching ros.rosjava_core#apache_xmlrpc_common;0.0.0-SNAPSHOT(master) to its parents.
15:28:40.663 [DEBUG] [org.gradle.api.internal.artifacts.ivyservice.resolveengine.DependencyGraphBuilder] Attaching ros.rosjava_core#rosjava_bootstrap;0.0.0-SNAPSHOT(compile) to its parents.
15:28:40.663 [DEBUG] [org.gradle.api.internal.artifacts.ivyservice.resolveengine.DependencyGraphBuilder] Attaching ros.rosjava_core#rosjava_bootstrap;0.0.0-SNAPSHOT(master) to its parents.
15:28:40.664 [DEBUG] [org.gradle.api.internal.artifacts.ivyservice.resolveengine.DependencyGraphBuilder] Attaching ros.rosjava_core#apache_xmlrpc_server;0.0.0-SNAPSHOT(compile) to its parents.
15:28:40.664 [DEBUG] [org.gradle.api.internal.artifacts.ivyservice.resolveengine.DependencyGraphBuilder] Attaching ros.rosjava_core#apache_xmlrpc_server;0.0.0-SNAPSHOT(master) to its parents.
15:28:40.664 [DEBUG] [org.gradle.api.internal.artifacts.ivyservice.resolveengine.DependencyGraphBuilder] Attaching dnsjava#dnsjava;2.1.1(compile) to its parents.
15:28:40.665 [DEBUG] [org.gradle.api.internal.artifacts.ivyservice.resolveengine.DependencyGraphBuilder] Attaching dnsjava#dnsjava;2.1.1(master) to its parents.
15:28:40.665 [DEBUG] [org.gradle.api.internal.artifacts.ivyservice.resolveengine.DependencyGraphBuilder] Attaching org.jboss.netty#netty;3.2.4.Final(runtime) to its parents.
15:28:40.665 [DEBUG] [org.gradle.api.internal.artifacts.ivyservice.resolveengine.DependencyGraphBuilder] Attaching com.google.guava#guava;r07(runtime) to its parents.
15:28:40.666 [DEBUG] [org.gradle.api.internal.artifacts.ivyservice.resolveengine.DependencyGraphBuilder] Attaching org.apache.commons#com.springsource.org.apache.commons.net;2.0.0(runtime) to its parents.
15:28:40.666 [DEBUG] [org.gradle.api.internal.artifacts.ivyservice.resolveengine.DependencyGraphBuilder] Attaching org.apache.commons#com.springsource.org.apache.commons.logging;1.1.1(runtime) to its parents.
15:28:40.666 [DEBUG] [org.gradle.api.internal.artifacts.ivyservice.resolveengine.DependencyGraphBuilder] Attaching ros.rosjava_core#rosjava_messages;0.0.0-SNAPSHOT(runtime) to its parents.
15:28:40.667 [DEBUG] [org.gradle.api.internal.artifacts.ivyservice.resolveengine.DependencyGraphBuilder] Attaching ros.rosjava_core#apache_xmlrpc_client;0.0.0-SNAPSHOT(runtime) to its parents.
15:28:40.667 [DEBUG] [org.gradle.api.internal.artifacts.ivyservice.resolveengine.DependencyGraphBuilder] Attaching ros.rosjava_core#apache_xmlrpc_common;0.0.0-SNAPSHOT(runtime) to its parents.
15:28:40.667 [DEBUG] [org.gradle.api.internal.artifacts.ivyservice.resolveengine.DependencyGraphBuilder] Attaching ros.rosjava_core#rosjava_bootstrap;0.0.0-SNAPSHOT(runtime) to its parents.
15:28:40.668 [DEBUG] [org.gradle.api.internal.artifacts.ivyservice.resolveengine.DependencyGraphBuilder] Attaching ros.rosjava_core#apache_xmlrpc_server;0.0.0-SNAPSHOT(runtime) to its parents.
15:28:40.668 [DEBUG] [org.gradle.api.internal.artifacts.ivyservice.resolveengine.DependencyGraphBuilder] Attaching dnsjava#dnsjava;2.1.1(runtime) to its parents.
15:28:40.668 [DEBUG] [org.gradle.api.internal.artifacts.ivyservice.resolveengine.DependencyGraphBuilder] Attaching org.apache.ws.commons#ws-commons-util;1.0.1(compile) to its parents.
15:28:40.669 [DEBUG] [org.gradle.api.internal.artifacts.ivyservice.resolveengine.DependencyGraphBuilder] Attaching org.apache.ws.commons#ws-commons-util;1.0.1(master) to its parents.
15:28:40.669 [DEBUG] [org.gradle.api.internal.artifacts.ivyservice.resolveengine.DependencyGraphBuilder] Attaching org.apache.commons#com.springsource.org.apache.commons.httpclient;3.1.0(compile) to its parents.
15:28:40.669 [DEBUG] [org.gradle.api.internal.artifacts.ivyservice.resolveengine.DependencyGraphBuilder] Attaching org.apache.commons#com.springsource.org.apache.commons.httpclient;3.1.0(master) to its parents.
15:28:40.670 [DEBUG] [org.gradle.api.internal.artifacts.ivyservice.resolveengine.DependencyGraphBuilder] Attaching org.apache.commons#com.springsource.org.apache.commons.lang;2.4.0(compile) to its parents.
15:28:40.670 [DEBUG] [org.gradle.api.internal.artifacts.ivyservice.resolveengine.DependencyGraphBuilder] Attaching org.apache.commons#com.springsource.org.apache.commons.lang;2.4.0(master) to its parents.
15:28:40.670 [DEBUG] [org.gradle.api.internal.artifacts.ivyservice.resolveengine.DependencyGraphBuilder] Attaching org.apache.commons#com.springsource.org.apache.commons.codec;1.3.0(compile) to its parents.
15:28:40.671 [DEBUG] [org.gradle.api.internal.artifacts.ivyservice.resolveengine.DependencyGraphBuilder] Attaching org.apache.commons#com.springsource.org.apache.commons.codec;1.3.0(master) to its parents.
15:28:40.671 [DEBUG] [org.gradle.api.internal.artifacts.ivyservice.resolveengine.DependencyGraphBuilder] Attaching org.apache.commons#com.springsource.org.apache.commons.io;1.4.0(compile) to its parents.
15:28:40.672 [DEBUG] [org.gradle.api.internal.artifacts.ivyservice.resolveengine.DependencyGraphBuilder] Attaching org.apache.commons#com.springsource.org.apache.commons.io;1.4.0(master) to its parents.
15:28:40.672 [DEBUG] [org.gradle.api.internal.artifacts.ivyservice.resolveengine.DependencyGraphBuilder] Attaching org.apache.ws.commons#ws-commons-util;1.0.1(runtime) to its parents.
15:28:40.672 [DEBUG] [org.gradle.api.internal.artifacts.ivyservice.resolveengine.DependencyGraphBuilder] Attaching org.apache.commons#com.springsource.org.apache.commons.httpclient;3.1.0(runtime) to its parents.
15:28:40.673 [DEBUG] [org.gradle.api.internal.artifacts.ivyservice.resolveengine.DependencyGraphBuilder] Attaching org.apache.commons#com.springsource.org.apache.commons.lang;2.4.0(runtime) to its parents.
15:28:40.673 [DEBUG] [org.gradle.api.internal.artifacts.ivyservice.resolveengine.DependencyGraphBuilder] Attaching org.apache.commons#com.springsource.org.apache.commons.codec;1.3.0(runtime) to its parents.
15:28:40.673 [DEBUG] [org.gradle.api.internal.artifacts.ivyservice.resolveengine.DependencyGraphBuilder] Attaching org.apache.commons#com.springsource.org.apache.commons.io;1.4.0(runtime) to its parents.
15:28:40.674 [DEBUG] [org.gradle.cache.internal.btree.BTreePersistentIndexedCache] Closing cache module-metadata.bin (/home/phil/.gradle/caches/artifacts-8/module-metadata.bin)
15:28:40.674 [DEBUG] [org.gradle.cache.internal.btree.BTreePersistentIndexedCache] Closing cache dynamic-revisions.bin (/home/phil/.gradle/caches/artifacts-8/dynamic-revisions.bin)
15:28:40.675 [DEBUG] [org.gradle.cache.internal.DefaultFileLockManager] Releasing lock on artifact cache (/home/phil/.gradle/caches/artifacts-8).
15:28:40.676 [DEBUG] [org.gradle.api.internal.artifacts.ivyservice.ivyresolve.UserResolverChain] Attempting to download ros.rosjava_core#rosjava_geometry;0.0.0-SNAPSHOT!rosjava_geometry.jar using repository 'MavenLocal'
15:28:40.676 [DEBUG] [org.gradle.api.internal.artifacts.repositories.MavenResolver] maven-metadata not available: /home/phil/.m2/repository/ros/rosjava_core/rosjava_geometry/0.0.0-SNAPSHOT/maven-metadata.xml
15:28:40.676 [DEBUG] [org.gradle.api.internal.artifacts.ivyservice.IvyLoggingAdaper]    tried /home/phil/.m2/repository/ros/rosjava_core/rosjava_geometry/0.0.0-SNAPSHOT/rosjava_geometry-0.0.0-SNAPSHOT.jar
15:28:40.685 [DEBUG] [org.gradle.api.internal.artifacts.repositories.ResourceCollectionResolver] Loading /home/phil/.m2/repository/ros/rosjava_core/rosjava_geometry/0.0.0-SNAPSHOT/rosjava_geometry-0.0.0-SNAPSHOT.jar
15:28:40.686 [DEBUG] [org.gradle.api.internal.artifacts.ivyservice.IvyLoggingAdaper]  [NOT REQUIRED] ros.rosjava_core#rosjava_geometry;0.0.0-SNAPSHOT!rosjava_geometry.jar
15:28:40.686 [DEBUG] [org.gradle.api.internal.artifacts.ivyservice.ivyresolve.UserResolverChain] Attempting to download org.jboss.netty#netty;3.2.4.Final!netty.jar(bundle) using repository 'maven'
15:28:40.687 [DEBUG] [org.gradle.cache.internal.DefaultFileLockManager] Waiting to acquire exclusive lock on artifact cache (/home/phil/.gradle/caches/artifacts-8).
15:28:40.688 [DEBUG] [org.gradle.cache.internal.DefaultFileLockManager] Lock acquired.
15:28:40.688 [DEBUG] [org.gradle.cache.internal.btree.BTreePersistentIndexedCache] Opening cache artifacts.bin (/home/phil/.gradle/caches/artifacts-8/artifacts.bin)
15:28:40.689 [DEBUG] [org.gradle.api.internal.artifacts.ivyservice.ivyresolve.CachingModuleVersionRepository] Found artifact 'org.jboss.netty#netty;3.2.4.Final!netty.jar(bundle)' in resolver cache: /home/phil/.gradle/caches/artifacts-8/filestore/org.jboss.netty/netty/3.2.4.Final/bundle/d0112ab5206185ca5701f88d25c84927bf53dde1/netty-3.2.4.Final.jar
15:28:40.690 [DEBUG] [org.gradle.cache.internal.btree.BTreePersistentIndexedCache] Closing cache artifacts.bin (/home/phil/.gradle/caches/artifacts-8/artifacts.bin)
15:28:40.690 [DEBUG] [org.gradle.cache.internal.DefaultFileLockManager] Releasing lock on artifact cache (/home/phil/.gradle/caches/artifacts-8).
15:28:40.691 [DEBUG] [org.gradle.api.internal.artifacts.ivyservice.ivyresolve.UserResolverChain] Attempting to download com.google.guava#guava;r07!guava.jar using repository 'maven'
15:28:40.692 [DEBUG] [org.gradle.cache.internal.DefaultFileLockManager] Waiting to acquire exclusive lock on artifact cache (/home/phil/.gradle/caches/artifacts-8).
15:28:40.692 [DEBUG] [org.gradle.cache.internal.DefaultFileLockManager] Lock acquired.
15:28:40.693 [DEBUG] [org.gradle.cache.internal.btree.BTreePersistentIndexedCache] Opening cache artifacts.bin (/home/phil/.gradle/caches/artifacts-8/artifacts.bin)
15:28:40.694 [DEBUG] [org.gradle.api.internal.artifacts.ivyservice.ivyresolve.CachingModuleVersionRepository] Found artifact 'com.google.guava#guava;r07!guava.jar' in resolver cache: /home/phil/.gradle/caches/artifacts-8/filestore/com.google.guava/guava/r07/jar/d2e4d3138d0798b7500685ed85c78c712fb82fe5/guava-r07.jar
15:28:40.694 [DEBUG] [org.gradle.cache.internal.btree.BTreePersistentIndexedCache] Closing cache artifacts.bin (/home/phil/.gradle/caches/artifacts-8/artifacts.bin)
15:28:40.695 [DEBUG] [org.gradle.cache.internal.DefaultFileLockManager] Releasing lock on artifact cache (/home/phil/.gradle/caches/artifacts-8).
15:28:40.695 [DEBUG] [org.gradle.api.internal.artifacts.ivyservice.ivyresolve.UserResolverChain] Attempting to download org.apache.commons#com.springsource.org.apache.commons.net;2.0.0!com.springsource.org.apache.commons.net.jar using repository 'maven'
15:28:40.696 [DEBUG] [org.gradle.cache.internal.DefaultFileLockManager] Waiting to acquire exclusive lock on artifact cache (/home/phil/.gradle/caches/artifacts-8).
15:28:40.697 [DEBUG] [org.gradle.cache.internal.DefaultFileLockManager] Lock acquired.
15:28:40.697 [DEBUG] [org.gradle.cache.internal.btree.BTreePersistentIndexedCache] Opening cache artifacts.bin (/home/phil/.gradle/caches/artifacts-8/artifacts.bin)
15:28:40.698 [DEBUG] [org.gradle.api.internal.artifacts.ivyservice.ivyresolve.CachingModuleVersionRepository] Found artifact 'org.apache.commons#com.springsource.org.apache.commons.net;2.0.0!com.springsource.org.apache.commons.net.jar' in resolver cache: /home/phil/.gradle/caches/artifacts-8/filestore/org.apache.commons/com.springsource.org.apache.commons.net/2.0.0/jar/3e78766072ff5a5cf3f5431d973c430c94ec612/com.springsource.org.apache.commons.net-2.0.0.jar
15:28:40.699 [DEBUG] [org.gradle.cache.internal.btree.BTreePersistentIndexedCache] Closing cache artifacts.bin (/home/phil/.gradle/caches/artifacts-8/artifacts.bin)
15:28:40.699 [DEBUG] [org.gradle.cache.internal.DefaultFileLockManager] Releasing lock on artifact cache (/home/phil/.gradle/caches/artifacts-8).
15:28:40.700 [DEBUG] [org.gradle.api.internal.artifacts.ivyservice.ivyresolve.UserResolverChain] Attempting to download org.apache.commons#com.springsource.org.apache.commons.logging;1.1.1!com.springsource.org.apache.commons.logging.jar using repository 'maven'
15:28:40.701 [DEBUG] [org.gradle.cache.internal.DefaultFileLockManager] Waiting to acquire exclusive lock on artifact cache (/home/phil/.gradle/caches/artifacts-8).
15:28:40.701 [DEBUG] [org.gradle.cache.internal.DefaultFileLockManager] Lock acquired.
15:28:40.702 [DEBUG] [org.gradle.cache.internal.btree.BTreePersistentIndexedCache] Opening cache artifacts.bin (/home/phil/.gradle/caches/artifacts-8/artifacts.bin)
15:28:40.703 [DEBUG] [org.gradle.api.internal.artifacts.ivyservice.ivyresolve.CachingModuleVersionRepository] Found artifact 'org.apache.commons#com.springsource.org.apache.commons.logging;1.1.1!com.springsource.org.apache.commons.logging.jar' in resolver cache: /home/phil/.gradle/caches/artifacts-8/filestore/org.apache.commons/com.springsource.org.apache.commons.logging/1.1.1/jar/7657caf2c78e1d79c74d36f2ae128a115f7cc180/com.springsource.org.apache.commons.logging-1.1.1.jar
15:28:40.703 [DEBUG] [org.gradle.cache.internal.btree.BTreePersistentIndexedCache] Closing cache artifacts.bin (/home/phil/.gradle/caches/artifacts-8/artifacts.bin)
15:28:40.703 [DEBUG] [org.gradle.cache.internal.DefaultFileLockManager] Releasing lock on artifact cache (/home/phil/.gradle/caches/artifacts-8).
15:28:40.704 [DEBUG] [org.gradle.api.internal.artifacts.ivyservice.ivyresolve.UserResolverChain] Attempting to download org.apache.commons#com.springsource.org.apache.commons.lang;2.4.0!com.springsource.org.apache.commons.lang.jar using repository 'maven'
15:28:40.704 [DEBUG] [org.gradle.cache.internal.DefaultFileLockManager] Waiting to acquire exclusive lock on artifact cache (/home/phil/.gradle/caches/artifacts-8).
15:28:40.704 [DEBUG] [org.gradle.cache.internal.DefaultFileLockManager] Lock acquired.
15:28:40.705 [DEBUG] [org.gradle.cache.internal.btree.BTreePersistentIndexedCache] Opening cache artifacts.bin (/home/phil/.gradle/caches/artifacts-8/artifacts.bin)
15:28:40.705 [DEBUG] [org.gradle.api.internal.artifacts.ivyservice.ivyresolve.CachingModuleVersionRepository] Found artifact 'org.apache.commons#com.springsource.org.apache.commons.lang;2.4.0!com.springsource.org.apache.commons.lang.jar' in resolver cache: /home/phil/.gradle/caches/artifacts-8/filestore/org.apache.commons/com.springsource.org.apache.commons.lang/2.4.0/jar/686e3713650c8e3a5d98723b4d3e239586bf9822/com.springsource.org.apache.commons.lang-2.4.0.jar
15:28:40.706 [DEBUG] [org.gradle.cache.internal.btree.BTreePersistentIndexedCache] Closing cache artifacts.bin (/home/phil/.gradle/caches/artifacts-8/artifacts.bin)
15:28:40.706 [DEBUG] [org.gradle.cache.internal.DefaultFileLockManager] Releasing lock on artifact cache (/home/phil/.gradle/caches/artifacts-8).
15:28:40.706 [DEBUG] [org.gradle.api.internal.artifacts.ivyservice.ivyresolve.UserResolverChain] Attempting to download org.apache.commons#com.springsource.org.apache.commons.codec;1.3.0!com.springsource.org.apache.commons.codec.jar using repository 'maven'
15:28:40.707 [DEBUG] [org.gradle.cache.internal.DefaultFileLockManager] Waiting to acquire exclusive lock on artifact cache (/home/phil/.gradle/caches/artifacts-8).
15:28:40.707 [DEBUG] [org.gradle.cache.internal.DefaultFileLockManager] Lock acquired.
15:28:40.708 [DEBUG] [org.gradle.cache.internal.btree.BTreePersistentIndexedCache] Opening cache artifacts.bin (/home/phil/.gradle/caches/artifacts-8/artifacts.bin)
15:28:40.708 [DEBUG] [org.gradle.api.internal.artifacts.ivyservice.ivyresolve.CachingModuleVersionRepository] Found artifact 'org.apache.commons#com.springsource.org.apache.commons.codec;1.3.0!com.springsource.org.apache.commons.codec.jar' in resolver cache: /home/phil/.gradle/caches/artifacts-8/filestore/org.apache.commons/com.springsource.org.apache.commons.codec/1.3.0/jar/f8690570eb0913d750262bb4223eed30b0d619ed/com.springsource.org.apache.commons.codec-1.3.0.jar
15:28:40.709 [DEBUG] [org.gradle.cache.internal.btree.BTreePersistentIndexedCache] Closing cache artifacts.bin (/home/phil/.gradle/caches/artifacts-8/artifacts.bin)
15:28:40.709 [DEBUG] [org.gradle.cache.internal.DefaultFileLockManager] Releasing lock on artifact cache (/home/phil/.gradle/caches/artifacts-8).
15:28:40.709 [DEBUG] [org.gradle.api.internal.artifacts.ivyservice.ivyresolve.UserResolverChain] Attempting to download org.apache.commons#com.springsource.org.apache.commons.io;1.4.0!com.springsource.org.apache.commons.io.jar using repository 'maven'
15:28:40.710 [DEBUG] [org.gradle.cache.internal.DefaultFileLockManager] Waiting to acquire exclusive lock on artifact cache (/home/phil/.gradle/caches/artifacts-8).
15:28:40.710 [DEBUG] [org.gradle.cache.internal.DefaultFileLockManager] Lock acquired.
15:28:40.710 [DEBUG] [org.gradle.cache.internal.btree.BTreePersistentIndexedCache] Opening cache artifacts.bin (/home/phil/.gradle/caches/artifacts-8/artifacts.bin)
15:28:40.711 [DEBUG] [org.gradle.api.internal.artifacts.ivyservice.ivyresolve.CachingModuleVersionRepository] Found artifact 'org.apache.commons#com.springsource.org.apache.commons.io;1.4.0!com.springsource.org.apache.commons.io.jar' in resolver cache: /home/phil/.gradle/caches/artifacts-8/filestore/org.apache.commons/com.springsource.org.apache.commons.io/1.4.0/jar/51097cd000ec88214ff181c9f059947de1cf4a35/com.springsource.org.apache.commons.io-1.4.0.jar
15:28:40.711 [DEBUG] [org.gradle.cache.internal.btree.BTreePersistentIndexedCache] Closing cache artifacts.bin (/home/phil/.gradle/caches/artifacts-8/artifacts.bin)
15:28:40.712 [DEBUG] [org.gradle.cache.internal.DefaultFileLockManager] Releasing lock on artifact cache (/home/phil/.gradle/caches/artifacts-8).
15:28:40.712 [DEBUG] [org.gradle.api.internal.artifacts.ivyservice.ivyresolve.UserResolverChain] Attempting to download ros.rosjava_core#rosjava_bootstrap;0.0.0-SNAPSHOT!rosjava_bootstrap.jar using repository 'MavenLocal'
15:28:40.712 [DEBUG] [org.gradle.api.internal.artifacts.repositories.MavenResolver] maven-metadata not available: /home/phil/.m2/repository/ros/rosjava_core/rosjava_bootstrap/0.0.0-SNAPSHOT/maven-metadata.xml
15:28:40.713 [DEBUG] [org.gradle.api.internal.artifacts.ivyservice.IvyLoggingAdaper]    tried /home/phil/.m2/repository/ros/rosjava_core/rosjava_bootstrap/0.0.0-SNAPSHOT/rosjava_bootstrap-0.0.0-SNAPSHOT.jar
15:28:40.713 [DEBUG] [org.gradle.api.internal.artifacts.repositories.ResourceCollectionResolver] Loading /home/phil/.m2/repository/ros/rosjava_core/rosjava_bootstrap/0.0.0-SNAPSHOT/rosjava_bootstrap-0.0.0-SNAPSHOT.jar
15:28:40.713 [DEBUG] [org.gradle.api.internal.artifacts.ivyservice.IvyLoggingAdaper]  [NOT REQUIRED] ros.rosjava_core#rosjava_bootstrap;0.0.0-SNAPSHOT!rosjava_bootstrap.jar
15:28:40.714 [DEBUG] [org.gradle.api.internal.artifacts.ivyservice.ivyresolve.UserResolverChain] Attempting to download ros.rosjava_core#rosjava_messages;0.0.0-SNAPSHOT!rosjava_messages.jar using repository 'MavenLocal'
15:28:40.714 [DEBUG] [org.gradle.api.internal.artifacts.repositories.MavenResolver] maven-metadata not available: /home/phil/.m2/repository/ros/rosjava_core/rosjava_messages/0.0.0-SNAPSHOT/maven-metadata.xml
15:28:40.722 [DEBUG] [org.gradle.api.internal.artifacts.ivyservice.IvyLoggingAdaper]    tried /home/phil/.m2/repository/ros/rosjava_core/rosjava_messages/0.0.0-SNAPSHOT/rosjava_messages-0.0.0-SNAPSHOT.jar
15:28:40.723 [DEBUG] [org.gradle.api.internal.artifacts.repositories.ResourceCollectionResolver] Loading /home/phil/.m2/repository/ros/rosjava_core/rosjava_messages/0.0.0-SNAPSHOT/rosjava_messages-0.0.0-SNAPSHOT.jar
15:28:40.723 [DEBUG] [org.gradle.api.internal.artifacts.ivyservice.IvyLoggingAdaper]  [NOT REQUIRED] ros.rosjava_core#rosjava_messages;0.0.0-SNAPSHOT!rosjava_messages.jar
15:28:40.724 [DEBUG] [org.gradle.api.internal.artifacts.ivyservice.ivyresolve.UserResolverChain] Attempting to download org.apache.ws.commons#ws-commons-util;1.0.1!ws-commons-util.jar using repository 'maven'
15:28:40.725 [DEBUG] [org.gradle.cache.internal.DefaultFileLockManager] Waiting to acquire exclusive lock on artifact cache (/home/phil/.gradle/caches/artifacts-8).
15:28:40.725 [DEBUG] [org.gradle.cache.internal.DefaultFileLockManager] Lock acquired.
15:28:40.726 [DEBUG] [org.gradle.cache.internal.btree.BTreePersistentIndexedCache] Opening cache artifacts.bin (/home/phil/.gradle/caches/artifacts-8/artifacts.bin)
15:28:40.727 [DEBUG] [org.gradle.api.internal.artifacts.ivyservice.ivyresolve.CachingModuleVersionRepository] Found artifact 'org.apache.ws.commons#ws-commons-util;1.0.1!ws-commons-util.jar' in resolver cache: /home/phil/.gradle/caches/artifacts-8/filestore/org.apache.ws.commons/ws-commons-util/1.0.1/jar/126e80ff798fece634bc94e61f8be8a8da00be60/ws-commons-util-1.0.1.jar
15:28:40.727 [DEBUG] [org.gradle.cache.internal.btree.BTreePersistentIndexedCache] Closing cache artifacts.bin (/home/phil/.gradle/caches/artifacts-8/artifacts.bin)
15:28:40.728 [DEBUG] [org.gradle.cache.internal.DefaultFileLockManager] Releasing lock on artifact cache (/home/phil/.gradle/caches/artifacts-8).
15:28:40.729 [DEBUG] [org.gradle.api.internal.artifacts.ivyservice.ivyresolve.UserResolverChain] Attempting to download org.apache.commons#com.springsource.org.apache.commons.httpclient;3.1.0!com.springsource.org.apache.commons.httpclient.jar using repository 'maven'
15:28:40.729 [DEBUG] [org.gradle.cache.internal.DefaultFileLockManager] Waiting to acquire exclusive lock on artifact cache (/home/phil/.gradle/caches/artifacts-8).
15:28:40.730 [DEBUG] [org.gradle.cache.internal.DefaultFileLockManager] Lock acquired.
15:28:40.730 [DEBUG] [org.gradle.cache.internal.btree.BTreePersistentIndexedCache] Opening cache artifacts.bin (/home/phil/.gradle/caches/artifacts-8/artifacts.bin)
15:28:40.731 [DEBUG] [org.gradle.api.internal.artifacts.ivyservice.ivyresolve.CachingModuleVersionRepository] Found artifact 'org.apache.commons#com.springsource.org.apache.commons.httpclient;3.1.0!com.springsource.org.apache.commons.httpclient.jar' in resolver cache: /home/phil/.gradle/caches/artifacts-8/filestore/org.apache.commons/com.springsource.org.apache.commons.httpclient/3.1.0/jar/c493a925a091ac3d8f449d9265fe12482dabb2a7/com.springsource.org.apache.commons.httpclient-3.1.0.jar
15:28:40.732 [DEBUG] [org.gradle.cache.internal.btree.BTreePersistentIndexedCache] Closing cache artifacts.bin (/home/phil/.gradle/caches/artifacts-8/artifacts.bin)
15:28:40.732 [DEBUG] [org.gradle.cache.internal.DefaultFileLockManager] Releasing lock on artifact cache (/home/phil/.gradle/caches/artifacts-8).
15:28:40.733 [DEBUG] [org.gradle.api.internal.artifacts.ivyservice.ivyresolve.UserResolverChain] Attempting to download ros.rosjava_core#apache_xmlrpc_common;0.0.0-SNAPSHOT!apache_xmlrpc_common.jar using repository 'MavenLocal'
15:28:40.733 [DEBUG] [org.gradle.api.internal.artifacts.repositories.MavenResolver] maven-metadata not available: /home/phil/.m2/repository/ros/rosjava_core/apache_xmlrpc_common/0.0.0-SNAPSHOT/maven-metadata.xml
15:28:40.733 [DEBUG] [org.gradle.api.internal.artifacts.ivyservice.IvyLoggingAdaper]    tried /home/phil/.m2/repository/ros/rosjava_core/apache_xmlrpc_common/0.0.0-SNAPSHOT/apache_xmlrpc_common-0.0.0-SNAPSHOT.jar
15:28:40.734 [DEBUG] [org.gradle.api.internal.artifacts.repositories.ResourceCollectionResolver] Loading /home/phil/.m2/repository/ros/rosjava_core/apache_xmlrpc_common/0.0.0-SNAPSHOT/apache_xmlrpc_common-0.0.0-SNAPSHOT.jar
15:28:40.734 [DEBUG] [org.gradle.api.internal.artifacts.ivyservice.IvyLoggingAdaper]  [NOT REQUIRED] ros.rosjava_core#apache_xmlrpc_common;0.0.0-SNAPSHOT!apache_xmlrpc_common.jar
15:28:40.735 [DEBUG] [org.gradle.api.internal.artifacts.ivyservice.ivyresolve.UserResolverChain] Attempting to download ros.rosjava_core#apache_xmlrpc_client;0.0.0-SNAPSHOT!apache_xmlrpc_client.jar using repository 'MavenLocal'
15:28:40.735 [DEBUG] [org.gradle.api.internal.artifacts.repositories.MavenResolver] maven-metadata not available: /home/phil/.m2/repository/ros/rosjava_core/apache_xmlrpc_client/0.0.0-SNAPSHOT/maven-metadata.xml
15:28:40.735 [DEBUG] [org.gradle.api.internal.artifacts.ivyservice.IvyLoggingAdaper]    tried /home/phil/.m2/repository/ros/rosjava_core/apache_xmlrpc_client/0.0.0-SNAPSHOT/apache_xmlrpc_client-0.0.0-SNAPSHOT.jar
15:28:40.736 [DEBUG] [org.gradle.api.internal.artifacts.repositories.ResourceCollectionResolver] Loading /home/phil/.m2/repository/ros/rosjava_core/apache_xmlrpc_client/0.0.0-SNAPSHOT/apache_xmlrpc_client-0.0.0-SNAPSHOT.jar
15:28:40.803 [DEBUG] [org.gradle.api.internal.artifacts.ivyservice.IvyLoggingAdaper]  [NOT REQUIRED] ros.rosjava_core#apache_xmlrpc_client;0.0.0-SNAPSHOT!apache_xmlrpc_client.jar
15:28:40.805 [DEBUG] [org.gradle.api.internal.artifacts.ivyservice.ivyresolve.UserResolverChain] Attempting to download ros.rosjava_core#apache_xmlrpc_server;0.0.0-SNAPSHOT!apache_xmlrpc_server.jar using repository 'MavenLocal'
15:28:40.805 [DEBUG] [org.gradle.api.internal.artifacts.repositories.MavenResolver] maven-metadata not available: /home/phil/.m2/repository/ros/rosjava_core/apache_xmlrpc_server/0.0.0-SNAPSHOT/maven-metadata.xml
15:28:40.806 [DEBUG] [org.gradle.api.internal.artifacts.ivyservice.IvyLoggingAdaper]    tried /home/phil/.m2/repository/ros/rosjava_core/apache_xmlrpc_server/0.0.0-SNAPSHOT/apache_xmlrpc_server-0.0.0-SNAPSHOT.jar
15:28:40.806 [DEBUG] [org.gradle.api.internal.artifacts.repositories.ResourceCollectionResolver] Loading /home/phil/.m2/repository/ros/rosjava_core/apache_xmlrpc_server/0.0.0-SNAPSHOT/apache_xmlrpc_server-0.0.0-SNAPSHOT.jar
15:28:40.807 [DEBUG] [org.gradle.api.internal.artifacts.ivyservice.IvyLoggingAdaper]  [NOT REQUIRED] ros.rosjava_core#apache_xmlrpc_server;0.0.0-SNAPSHOT!apache_xmlrpc_server.jar
15:28:40.808 [DEBUG] [org.gradle.api.internal.artifacts.ivyservice.ivyresolve.UserResolverChain] Attempting to download dnsjava#dnsjava;2.1.1!dnsjava.jar using repository 'maven'
15:28:40.808 [DEBUG] [org.gradle.cache.internal.DefaultFileLockManager] Waiting to acquire exclusive lock on artifact cache (/home/phil/.gradle/caches/artifacts-8).
15:28:40.809 [DEBUG] [org.gradle.cache.internal.DefaultFileLockManager] Lock acquired.
15:28:40.810 [DEBUG] [org.gradle.cache.internal.btree.BTreePersistentIndexedCache] Opening cache artifacts.bin (/home/phil/.gradle/caches/artifacts-8/artifacts.bin)
15:28:40.811 [DEBUG] [org.gradle.api.internal.artifacts.ivyservice.ivyresolve.CachingModuleVersionRepository] Found artifact 'dnsjava#dnsjava;2.1.1!dnsjava.jar' in resolver cache: /home/phil/.gradle/caches/artifacts-8/filestore/dnsjava/dnsjava/2.1.1/jar/5708df81cf6dbff545695f0be6380b7bbc85accc/dnsjava-2.1.1.jar
15:28:40.811 [DEBUG] [org.gradle.cache.internal.btree.BTreePersistentIndexedCache] Closing cache artifacts.bin (/home/phil/.gradle/caches/artifacts-8/artifacts.bin)
15:28:40.812 [DEBUG] [org.gradle.cache.internal.DefaultFileLockManager] Releasing lock on artifact cache (/home/phil/.gradle/caches/artifacts-8).
15:28:40.812 [DEBUG] [org.gradle.api.internal.artifacts.ivyservice.ivyresolve.UserResolverChain] Attempting to download ros.rosjava_core#rosjava;0.0.0-SNAPSHOT!rosjava.jar using repository 'MavenLocal'
15:28:40.813 [DEBUG] [org.gradle.api.internal.artifacts.repositories.MavenResolver] maven-metadata not available: /home/phil/.m2/repository/ros/rosjava_core/rosjava/0.0.0-SNAPSHOT/maven-metadata.xml
15:28:40.813 [DEBUG] [org.gradle.api.internal.artifacts.ivyservice.IvyLoggingAdaper]    tried /home/phil/.m2/repository/ros/rosjava_core/rosjava/0.0.0-SNAPSHOT/rosjava-0.0.0-SNAPSHOT.jar
15:28:40.814 [DEBUG] [org.gradle.api.internal.artifacts.repositories.ResourceCollectionResolver] Loading /home/phil/.m2/repository/ros/rosjava_core/rosjava/0.0.0-SNAPSHOT/rosjava-0.0.0-SNAPSHOT.jar
15:28:40.814 [DEBUG] [org.gradle.api.internal.artifacts.ivyservice.IvyLoggingAdaper]  [NOT REQUIRED] ros.rosjava_core#rosjava;0.0.0-SNAPSHOT!rosjava.jar
15:28:40.819 [DEBUG] [org.gradle.api.internal.tasks.execution.SkipUpToDateTaskExecuter] Determining if task ':android_honeycomb_mr2:deployLibs' is up-to-date
15:28:40.819 [DEBUG] [org.gradle.cache.internal.DefaultFileLockManager] Waiting to acquire exclusive lock on task artifact state cache (/home/phil/my_workspace/android_core/.gradle/1.0-milestone-9/taskArtifacts).
15:28:40.819 [DEBUG] [org.gradle.cache.internal.DefaultFileLockManager] Lock acquired.
15:28:40.820 [DEBUG] [org.gradle.cache.internal.btree.BTreePersistentIndexedCache] Opening cache taskArtifacts.bin (/home/phil/my_workspace/android_core/.gradle/1.0-milestone-9/taskArtifacts/taskArtifacts.bin)
15:28:40.825 [DEBUG] [org.gradle.api.internal.changedetection.DefaultFileCacheListener] Can cache files for file '/home/phil/.m2/repository/ros/rosjava_core/rosjava_geometry/0.0.0-SNAPSHOT/rosjava_geometry-0.0.0-SNAPSHOT.jar'
15:28:40.825 [DEBUG] [org.gradle.api.internal.changedetection.DefaultFileCacheListener] Can cache files for file '/home/phil/.gradle/caches/artifacts-8/filestore/org.jboss.netty/netty/3.2.4.Final/bundle/d0112ab5206185ca5701f88d25c84927bf53dde1/netty-3.2.4.Final.jar'
15:28:40.825 [DEBUG] [org.gradle.api.internal.changedetection.DefaultFileCacheListener] Can cache files for file '/home/phil/.gradle/caches/artifacts-8/filestore/com.google.guava/guava/r07/jar/d2e4d3138d0798b7500685ed85c78c712fb82fe5/guava-r07.jar'
15:28:40.862 [DEBUG] [org.gradle.api.internal.changedetection.DefaultFileCacheListener] Can cache files for file '/home/phil/.gradle/caches/artifacts-8/filestore/org.apache.commons/com.springsource.org.apache.commons.net/2.0.0/jar/3e78766072ff5a5cf3f5431d973c430c94ec612/com.springsource.org.apache.commons.net-2.0.0.jar'
15:28:40.863 [DEBUG] [org.gradle.api.internal.changedetection.DefaultFileCacheListener] Can cache files for file '/home/phil/.gradle/caches/artifacts-8/filestore/org.apache.commons/com.springsource.org.apache.commons.logging/1.1.1/jar/7657caf2c78e1d79c74d36f2ae128a115f7cc180/com.springsource.org.apache.commons.logging-1.1.1.jar'
15:28:40.863 [DEBUG] [org.gradle.api.internal.changedetection.DefaultFileCacheListener] Can cache files for file '/home/phil/.gradle/caches/artifacts-8/filestore/org.apache.commons/com.springsource.org.apache.commons.lang/2.4.0/jar/686e3713650c8e3a5d98723b4d3e239586bf9822/com.springsource.org.apache.commons.lang-2.4.0.jar'
15:28:40.864 [DEBUG] [org.gradle.api.internal.changedetection.DefaultFileCacheListener] Can cache files for file '/home/phil/.gradle/caches/artifacts-8/filestore/org.apache.commons/com.springsource.org.apache.commons.codec/1.3.0/jar/f8690570eb0913d750262bb4223eed30b0d619ed/com.springsource.org.apache.commons.codec-1.3.0.jar'
15:28:40.864 [DEBUG] [org.gradle.api.internal.changedetection.DefaultFileCacheListener] Can cache files for file '/home/phil/.gradle/caches/artifacts-8/filestore/org.apache.commons/com.springsource.org.apache.commons.io/1.4.0/jar/51097cd000ec88214ff181c9f059947de1cf4a35/com.springsource.org.apache.commons.io-1.4.0.jar'
15:28:40.864 [DEBUG] [org.gradle.api.internal.changedetection.DefaultFileCacheListener] Can cache files for file '/home/phil/.m2/repository/ros/rosjava_core/rosjava_bootstrap/0.0.0-SNAPSHOT/rosjava_bootstrap-0.0.0-SNAPSHOT.jar'
15:28:40.865 [DEBUG] [org.gradle.api.internal.changedetection.DefaultFileCacheListener] Can cache files for file '/home/phil/.m2/repository/ros/rosjava_core/rosjava_messages/0.0.0-SNAPSHOT/rosjava_messages-0.0.0-SNAPSHOT.jar'
15:28:40.865 [DEBUG] [org.gradle.api.internal.changedetection.DefaultFileCacheListener] Can cache files for file '/home/phil/.gradle/caches/artifacts-8/filestore/org.apache.ws.commons/ws-commons-util/1.0.1/jar/126e80ff798fece634bc94e61f8be8a8da00be60/ws-commons-util-1.0.1.jar'
15:28:40.866 [DEBUG] [org.gradle.api.internal.changedetection.DefaultFileCacheListener] Can cache files for file '/home/phil/.gradle/caches/artifacts-8/filestore/org.apache.commons/com.springsource.org.apache.commons.httpclient/3.1.0/jar/c493a925a091ac3d8f449d9265fe12482dabb2a7/com.springsource.org.apache.commons.httpclient-3.1.0.jar'
15:28:40.866 [DEBUG] [org.gradle.api.internal.changedetection.DefaultFileCacheListener] Can cache files for file '/home/phil/.m2/repository/ros/rosjava_core/apache_xmlrpc_common/0.0.0-SNAPSHOT/apache_xmlrpc_common-0.0.0-SNAPSHOT.jar'
15:28:40.867 [DEBUG] [org.gradle.api.internal.changedetection.DefaultFileCacheListener] Can cache files for file '/home/phil/.m2/repository/ros/rosjava_core/apache_xmlrpc_client/0.0.0-SNAPSHOT/apache_xmlrpc_client-0.0.0-SNAPSHOT.jar'
15:28:40.867 [DEBUG] [org.gradle.api.internal.changedetection.DefaultFileCacheListener] Can cache files for file '/home/phil/.m2/repository/ros/rosjava_core/apache_xmlrpc_server/0.0.0-SNAPSHOT/apache_xmlrpc_server-0.0.0-SNAPSHOT.jar'
15:28:40.867 [DEBUG] [org.gradle.api.internal.changedetection.DefaultFileCacheListener] Can cache files for file '/home/phil/.gradle/caches/artifacts-8/filestore/dnsjava/dnsjava/2.1.1/jar/5708df81cf6dbff545695f0be6380b7bbc85accc/dnsjava-2.1.1.jar'
15:28:40.868 [DEBUG] [org.gradle.api.internal.changedetection.DefaultFileCacheListener] Can cache files for file '/home/phil/.m2/repository/ros/rosjava_core/rosjava/0.0.0-SNAPSHOT/rosjava-0.0.0-SNAPSHOT.jar'
15:28:40.869 [DEBUG] [org.gradle.api.internal.changedetection.DefaultFileCacheListener] Can cache files for file '/home/phil/my_workspace/android_core/android_honeycomb_mr2/libs'
15:28:40.869 [DEBUG] [org.gradle.cache.internal.btree.BTreePersistentIndexedCache] Opening cache outputFileStates.bin (/home/phil/my_workspace/android_core/.gradle/1.0-milestone-9/taskArtifacts/outputFileStates.bin)
15:28:40.871 [DEBUG] [org.gradle.cache.internal.btree.BTreePersistentIndexedCache] Opening cache fileHashes.bin (/home/phil/my_workspace/android_core/.gradle/1.0-milestone-9/taskArtifacts/fileHashes.bin)
15:28:40.878 [DEBUG] [org.gradle.cache.internal.btree.BTreePersistentIndexedCache] Opening cache fileSnapshots.bin (/home/phil/my_workspace/android_core/.gradle/1.0-milestone-9/taskArtifacts/fileSnapshots.bin)
15:28:40.879 [INFO] [org.gradle.api.internal.changedetection.DefaultTaskArtifactStateRepository] Skipping task ':android_honeycomb_mr2:deployLibs' as it is up-to-date.
15:28:40.879 [INFO] [org.gradle.api.internal.tasks.execution.SkipUpToDateTaskExecuter] Skipping task ':android_honeycomb_mr2:deployLibs' as it is up-to-date
15:28:40.879 [DEBUG] [org.gradle.api.internal.tasks.execution.ExecuteAtMostOnceTaskExecuter] Finished executing task ':android_honeycomb_mr2:deployLibs'
15:28:40.880 [LIFECYCLE] [org.gradle.TaskExecutionLogger] :android_honeycomb_mr2:deployLibs UP-TO-DATE
15:28:40.880 [LIFECYCLE] [org.gradle.TaskExecutionLogger] :android_honeycomb_mr2:updateProject
15:28:40.880 [DEBUG] [org.gradle.api.internal.tasks.execution.ExecuteAtMostOnceTaskExecuter] Starting to execute task ':android_honeycomb_mr2:updateProject'
15:28:40.952 [DEBUG] [org.gradle.api.internal.tasks.execution.SkipUpToDateTaskExecuter] Determining if task ':android_honeycomb_mr2:updateProject' is up-to-date
15:28:40.953 [INFO] [org.gradle.api.internal.changedetection.ShortCircuitTaskArtifactStateRepository] Task ':android_honeycomb_mr2:updateProject' has not declared any outputs, assuming that it is out-of-date.
15:28:40.953 [DEBUG] [org.gradle.api.internal.tasks.execution.SkipUpToDateTaskExecuter] task ':android_honeycomb_mr2:updateProject' is not up-to-date
15:28:40.954 [DEBUG] [org.gradle.api.internal.changedetection.DefaultFileCacheListener] Invalidate all cached files
15:28:40.954 [DEBUG] [org.gradle.cache.internal.btree.BTreePersistentIndexedCache] Closing cache fileSnapshots.bin (/home/phil/my_workspace/android_core/.gradle/1.0-milestone-9/taskArtifacts/fileSnapshots.bin)
15:28:40.955 [DEBUG] [org.gradle.cache.internal.btree.BTreePersistentIndexedCache] Closing cache outputFileStates.bin (/home/phil/my_workspace/android_core/.gradle/1.0-milestone-9/taskArtifacts/outputFileStates.bin)
15:28:40.955 [DEBUG] [org.gradle.cache.internal.btree.BTreePersistentIndexedCache] Closing cache taskArtifacts.bin (/home/phil/my_workspace/android_core/.gradle/1.0-milestone-9/taskArtifacts/taskArtifacts.bin)
15:28:40.956 [DEBUG] [org.gradle.cache.internal.btree.BTreePersistentIndexedCache] Closing cache fileHashes.bin (/home/phil/my_workspace/android_core/.gradle/1.0-milestone-9/taskArtifacts/fileHashes.bin)
15:28:40.956 [DEBUG] [org.gradle.cache.internal.DefaultFileLockManager] Releasing lock on task artifact state cache (/home/phil/my_workspace/android_core/.gradle/1.0-milestone-9/taskArtifacts).
15:28:40.957 [DEBUG] [org.gradle.api.internal.tasks.execution.ExecuteActionsTaskExecuter] Executing actions for task ':android_honeycomb_mr2:updateProject'.
15:28:40.958 [DEBUG] [org.gradle.process.internal.ProcessBuilderFactory] creating process builder for command 'android'
15:28:40.958 [DEBUG] [org.gradle.process.internal.ProcessBuilderFactory] in directory /home/phil/my_workspace/android_core/android_honeycomb_mr2
15:28:40.959 [DEBUG] [org.gradle.process.internal.ProcessBuilderFactory] with argument#0 = update
15:28:40.959 [DEBUG] [org.gradle.process.internal.ProcessBuilderFactory] with argument#1 = project
15:28:40.959 [DEBUG] [org.gradle.process.internal.ProcessBuilderFactory] with argument#2 = -p
15:28:40.960 [DEBUG] [org.gradle.process.internal.ProcessBuilderFactory] with argument#3 = /home/phil/my_workspace/android_core/android_honeycomb_mr2
15:28:41.005 [DEBUG] [org.gradle.process.internal.DefaultExecHandle] Started command 'android'.
15:28:41.433 [ERROR] [system.err] Error: The project either has no target set or the target is invalid.
15:28:41.433 [ERROR] [system.err] Please provide a --target to the 'android update' command.
15:28:41.451 [DEBUG] [org.gradle.process.internal.DefaultExecHandle] Process finished (code: 0) for command 'android'.
15:28:41.451 [DEBUG] [org.gradle.logging.internal.DefaultLoggingConfigurer] Finished configuring with level: DEBUG, configurers: [org.gradle.logging.internal.OutputEventRenderer@2bd1e730, org.gradle.logging.internal.slf4j.Slf4jLoggingConfigurer@61a116c9, org.gradle.logging.internal.JavaUtilLoggingConfigurer@16df1832]
15:28:41.452 [DEBUG] [org.gradle.api.internal.tasks.execution.ExecuteAtMostOnceTaskExecuter] Finished executing task ':android_honeycomb_mr2:updateProject'
15:28:41.453 [LIFECYCLE] [org.gradle.TaskExecutionLogger] :android_honeycomb_mr2:debug
15:28:41.453 [DEBUG] [org.gradle.api.internal.tasks.execution.ExecuteAtMostOnceTaskExecuter] Starting to execute task ':android_honeycomb_mr2:debug'
15:28:41.454 [DEBUG] [org.gradle.api.internal.tasks.execution.SkipUpToDateTaskExecuter] Determining if task ':android_honeycomb_mr2:debug' is up-to-date
15:28:41.454 [INFO] [org.gradle.api.internal.changedetection.ShortCircuitTaskArtifactStateRepository] Task ':android_honeycomb_mr2:debug' has not declared any outputs, assuming that it is out-of-date.
15:28:41.455 [DEBUG] [org.gradle.api.internal.tasks.execution.SkipUpToDateTaskExecuter] task ':android_honeycomb_mr2:debug' is not up-to-date
15:28:41.455 [DEBUG] [org.gradle.api.internal.changedetection.DefaultFileCacheListener] Invalidate all cached files
15:28:41.456 [DEBUG] [org.gradle.api.internal.tasks.execution.ExecuteActionsTaskExecuter] Executing actions for task ':android_honeycomb_mr2:debug'.
15:28:41.457 [DEBUG] [org.gradle.process.internal.ProcessBuilderFactory] creating process builder for command 'ant'
15:28:41.457 [DEBUG] [org.gradle.process.internal.ProcessBuilderFactory] in directory /home/phil/my_workspace/android_core/android_honeycomb_mr2
15:28:41.458 [DEBUG] [org.gradle.process.internal.ProcessBuilderFactory] with argument#0 = debug
15:28:41.505 [DEBUG] [org.gradle.process.internal.DefaultExecHandle] Started command 'ant'.
15:28:41.724 [QUIET] [system.out] Buildfile: build.xml does not exist!
15:28:41.726 [ERROR] [system.err] Build failed
15:28:41.732 [DEBUG] [org.gradle.process.internal.DefaultExecHandle] Process finished (code: 1) for command 'ant'.
15:28:41.733 [DEBUG] [org.gradle.logging.internal.DefaultLoggingConfigurer] Finished configuring with level: DEBUG, configurers: [org.gradle.logging.internal.OutputEventRenderer@2bd1e730, org.gradle.logging.internal.slf4j.Slf4jLoggingConfigurer@61a116c9, org.gradle.logging.internal.JavaUtilLoggingConfigurer@16df1832]
15:28:41.733 [DEBUG] [org.gradle.api.internal.tasks.execution.ExecuteAtMostOnceTaskExecuter] Finished executing task ':android_honeycomb_mr2:debug'
15:28:41.734 [ERROR] [org.gradle.BuildExceptionReporter] 
15:28:41.735 [ERROR] [org.gradle.BuildExceptionReporter] FAILURE: Build failed with an exception.
15:28:41.735 [ERROR] [org.gradle.BuildExceptionReporter] 
15:28:41.735 [ERROR] [org.gradle.BuildExceptionReporter] * What went wrong:
15:28:41.735 [ERROR] [org.gradle.BuildExceptionReporter] Execution failed for task ':android_honeycomb_mr2:debug'.
15:28:41.736 [ERROR] [org.gradle.BuildExceptionReporter] > Command 'ant' finished with (non-zero) exit value 1.
15:28:41.736 [ERROR] [org.gradle.BuildExceptionReporter] 
15:28:41.736 [ERROR] [org.gradle.BuildExceptionReporter] * Exception is:
15:28:41.737 [ERROR] [org.gradle.BuildExceptionReporter] org.gradle.api.tasks.TaskExecutionException: Execution failed for task ':android_honeycomb_mr2:debug'.
15:28:41.737 [ERROR] [org.gradle.BuildExceptionReporter]  at org.gradle.api.internal.tasks.execution.ExecuteActionsTaskExecuter.executeActions(ExecuteActionsTaskExecuter.java:68)
15:28:41.737 [ERROR] [org.gradle.BuildExceptionReporter]  at org.gradle.api.internal.tasks.execution.ExecuteActionsTaskExecuter.execute(ExecuteActionsTaskExecuter.java:46)
15:28:41.737 [ERROR] [org.gradle.BuildExceptionReporter]  at org.gradle.api.internal.tasks.execution.PostExecutionAnalysisTaskExecuter.execute(PostExecutionAnalysisTaskExecuter.java:34)
15:28:41.738 [ERROR] [org.gradle.BuildExceptionReporter]  at org.gradle.api.internal.changedetection.CacheLockHandlingTaskExecuter$1.run(CacheLockHandlingTaskExecuter.java:34)
15:28:41.738 [ERROR] [org.gradle.BuildExceptionReporter]  at org.gradle.cache.internal.DefaultCacheAccess$2.create(DefaultCacheAccess.java:200)
15:28:41.738 [ERROR] [org.gradle.BuildExceptionReporter]  at org.gradle.cache.internal.DefaultCacheAccess.longRunningOperation(DefaultCacheAccess.java:172)
15:28:41.738 [ERROR] [org.gradle.BuildExceptionReporter]  at org.gradle.cache.internal.DefaultCacheAccess.longRunningOperation(DefaultCacheAccess.java:198)
15:28:41.739 [ERROR] [org.gradle.BuildExceptionReporter]  at org.gradle.cache.internal.DefaultPersistentDirectoryStore.longRunningOperation(DefaultPersistentDirectoryStore.java:111)
15:28:41.739 [ERROR] [org.gradle.BuildExceptionReporter]  at org.gradle.api.internal.changedetection.DefaultTaskArtifactStateCacheAccess.longRunningOperation(DefaultTaskArtifactStateCacheAccess.java:83)
15:28:41.739 [ERROR] [org.gradle.BuildExceptionReporter]  at org.gradle.api.internal.changedetection.CacheLockHandlingTaskExecuter.execute(CacheLockHandlingTaskExecuter.java:32)
15:28:41.739 [ERROR] [org.gradle.BuildExceptionReporter]  at org.gradle.api.internal.tasks.execution.SkipUpToDateTaskExecuter.execute(SkipUpToDateTaskExecuter.java:55)
15:28:41.740 [ERROR] [org.gradle.BuildExceptionReporter]  at org.gradle.api.internal.tasks.execution.ValidatingTaskExecuter.execute(ValidatingTaskExecuter.java:57)
15:28:41.740 [ERROR] [org.gradle.BuildExceptionReporter]  at org.gradle.api.internal.tasks.execution.SkipEmptySourceFilesTaskExecuter.execute(SkipEmptySourceFilesTaskExecuter.java:41)
15:28:41.740 [ERROR] [org.gradle.BuildExceptionReporter]  at org.gradle.api.internal.tasks.execution.SkipTaskWithNoActionsExecuter.execute(SkipTaskWithNoActionsExecuter.java:51)
15:28:41.740 [ERROR] [org.gradle.BuildExceptionReporter]  at org.gradle.api.internal.tasks.execution.SkipOnlyIfTaskExecuter.execute(SkipOnlyIfTaskExecuter.java:52)
15:28:41.741 [ERROR] [org.gradle.BuildExceptionReporter]  at org.gradle.api.internal.tasks.execution.ExecuteAtMostOnceTaskExecuter.execute(ExecuteAtMostOnceTaskExecuter.java:42)
15:28:41.741 [ERROR] [org.gradle.BuildExceptionReporter]  at org.gradle.api.internal.AbstractTask.executeWithoutThrowingTaskFailure(AbstractTask.java:247)
15:28:41.741 [ERROR] [org.gradle.BuildExceptionReporter]  at org.gradle.execution.DefaultTaskGraphExecuter.executeTask(DefaultTaskGraphExecuter.java:192)
15:28:41.741 [ERROR] [org.gradle.BuildExceptionReporter]  at org.gradle.execution.DefaultTaskGraphExecuter.doExecute(DefaultTaskGraphExecuter.java:177)
15:28:41.741 [ERROR] [org.gradle.BuildExceptionReporter]  at org.gradle.execution.DefaultTaskGraphExecuter.execute(DefaultTaskGraphExecuter.java:83)
15:28:41.742 [ERROR] [org.gradle.BuildExceptionReporter]  at org.gradle.execution.SelectedTaskExecutionAction.execute(SelectedTaskExecutionAction.java:36)
15:28:41.749 [ERROR] [org.gradle.BuildExceptionReporter]  at org.gradle.execution.DefaultBuildExecuter.execute(DefaultBuildExecuter.java:61)
15:28:41.749 [ERROR] [org.gradle.BuildExceptionReporter]  at org.gradle.execution.DefaultBuildExecuter.access$200(DefaultBuildExecuter.java:23)
15:28:41.749 [ERROR] [org.gradle.BuildExceptionReporter]  at org.gradle.execution.DefaultBuildExecuter$2.proceed(DefaultBuildExecuter.java:67)
15:28:41.750 [ERROR] [org.gradle.BuildExceptionReporter]  at org.gradle.api.internal.changedetection.TaskCacheLockHandlingBuildExecuter$1.run(TaskCacheLockHandlingBuildExecuter.java:31)
15:28:41.750 [ERROR] [org.gradle.BuildExceptionReporter]  at org.gradle.cache.internal.DefaultCacheAccess$1.create(DefaultCacheAccess.java:111)
15:28:41.752 [ERROR] [org.gradle.BuildExceptionReporter]  at org.gradle.cache.internal.DefaultCacheAccess.useCache(DefaultCacheAccess.java:126)
15:28:41.752 [ERROR] [org.gradle.BuildExceptionReporter]  at org.gradle.cache.internal.DefaultCacheAccess.useCache(DefaultCacheAccess.java:109)
15:28:41.753 [ERROR] [org.gradle.BuildExceptionReporter]  at org.gradle.cache.internal.DefaultPersistentDirectoryStore.useCache(DefaultPersistentDirectoryStore.java:103)
15:28:41.753 [ERROR] [org.gradle.BuildExceptionReporter]  at org.gradle.api.internal.changedetection.DefaultTaskArtifactStateCacheAccess.useCache(DefaultTaskArtifactStateCacheAccess.java:79)
15:28:41.753 [ERROR] [org.gradle.BuildExceptionReporter]  at org.gradle.api.internal.changedetection.TaskCacheLockHandlingBuildExecuter.execute(TaskCacheLockHandlingBuildExecuter.java:29)
15:28:41.753 [ERROR] [org.gradle.BuildExceptionReporter]  at org.gradle.execution.DefaultBuildExecuter.execute(DefaultBuildExecuter.java:61)
15:28:41.754 [ERROR] [org.gradle.BuildExceptionReporter]  at org.gradle.execution.DefaultBuildExecuter.access$200(DefaultBuildExecuter.java:23)
15:28:41.754 [ERROR] [org.gradle.BuildExceptionReporter]  at org.gradle.execution.DefaultBuildExecuter$2.proceed(DefaultBuildExecuter.java:67)
15:28:41.754 [ERROR] [org.gradle.BuildExceptionReporter]  at org.gradle.execution.DryRunBuildExecutionAction.execute(DryRunBuildExecutionAction.java:32)
15:28:41.754 [ERROR] [org.gradle.BuildExceptionReporter]  at org.gradle.execution.DefaultBuildExecuter.execute(DefaultBuildExecuter.java:61)
15:28:41.755 [ERROR] [org.gradle.BuildExceptionReporter]  at org.gradle.execution.DefaultBuildExecuter.execute(DefaultBuildExecuter.java:54)
15:28:41.755 [ERROR] [org.gradle.BuildExceptionReporter]  at org.gradle.initialization.DefaultGradleLauncher.doBuildStages(DefaultGradleLauncher.java:155)
15:28:41.755 [ERROR] [org.gradle.BuildExceptionReporter]  at org.gradle.initialization.DefaultGradleLauncher.doBuild(DefaultGradleLauncher.java:110)
15:28:41.755 [ERROR] [org.gradle.BuildExceptionReporter]  at org.gradle.initialization.DefaultGradleLauncher.run(DefaultGradleLauncher.java:78)
15:28:41.756 [ERROR] [org.gradle.BuildExceptionReporter]  at org.gradle.launcher.cli.ExecuteBuildAction.run(ExecuteBuildAction.java:45)
15:28:41.756 [ERROR] [org.gradle.BuildExceptionReporter]  at org.gradle.launcher.daemon.protocol.Build.run(Build.java:67)
15:28:41.756 [ERROR] [org.gradle.BuildExceptionReporter]  at org.gradle.launcher.daemon.protocol.Build.run(Build.java:63)
15:28:41.757 [ERROR] [org.gradle.BuildExceptionReporter]  at org.gradle.launcher.daemon.server.exec.ExecuteBuild.doBuild(ExecuteBuild.java:45)
15:28:41.757 [ERROR] [org.gradle.BuildExceptionReporter]  at org.gradle.launcher.daemon.server.exec.BuildCommandOnly.execute(BuildCommandOnly.java:34)
15:28:41.757 [ERROR] [org.gradle.BuildExceptionReporter]  at org.gradle.launcher.daemon.server.exec.DaemonCommandExecution.proceed(DaemonCommandExecution.java:122)
15:28:41.757 [ERROR] [org.gradle.BuildExceptionReporter]  at org.gradle.launcher.daemon.server.exec.WatchForDisconnection.execute(WatchForDisconnection.java:45)
15:28:41.758 [ERROR] [org.gradle.BuildExceptionReporter]  at org.gradle.launcher.daemon.server.exec.DaemonCommandExecution.proceed(DaemonCommandExecution.java:122)
15:28:41.758 [ERROR] [org.gradle.BuildExceptionReporter]  at org.gradle.launcher.daemon.server.exec.ResetDeprecationLogger.execute(ResetDeprecationLogger.java:24)
15:28:41.758 [ERROR] [org.gradle.BuildExceptionReporter]  at org.gradle.launcher.daemon.server.exec.DaemonCommandExecution.proceed(DaemonCommandExecution.java:122)
15:28:41.758 [ERROR] [org.gradle.BuildExceptionReporter]  at org.gradle.launcher.daemon.server.exec.ReturnResult.execute(ReturnResult.java:34)
15:28:41.759 [ERROR] [org.gradle.BuildExceptionReporter]  at org.gradle.launcher.daemon.server.exec.DaemonCommandExecution.proceed(DaemonCommandExecution.java:122)
15:28:41.759 [ERROR] [org.gradle.BuildExceptionReporter]  at org.gradle.launcher.daemon.server.exec.ForwardClientInput$4.call(ForwardClientInput.java:116)
15:28:41.759 [ERROR] [org.gradle.BuildExceptionReporter]  at org.gradle.launcher.daemon.server.exec.ForwardClientInput$4.call(ForwardClientInput.java:114)
15:28:41.760 [ERROR] [org.gradle.BuildExceptionReporter]  at org.gradle.util.Swapper.swap(Swapper.java:38)
15:28:41.760 [ERROR] [org.gradle.BuildExceptionReporter]  at org.gradle.launcher.daemon.server.exec.ForwardClientInput.execute(ForwardClientInput.java:114)
15:28:41.760 [ERROR] [org.gradle.BuildExceptionReporter]  at org.gradle.launcher.daemon.server.exec.DaemonCommandExecution.proceed(DaemonCommandExecution.java:122)
15:28:41.760 [ERROR] [org.gradle.BuildExceptionReporter]  at org.gradle.launcher.daemon.server.exec.LogToClient.doBuild(LogToClient.java:60)
15:28:41.761 [ERROR] [org.gradle.BuildExceptionReporter]  at org.gradle.launcher.daemon.server.exec.BuildCommandOnly.execute(BuildCommandOnly.java:34)
15:28:41.761 [ERROR] [org.gradle.BuildExceptionReporter]  at org.gradle.launcher.daemon.server.exec.DaemonCommandExecution.proceed(DaemonCommandExecution.java:122)
15:28:41.761 [ERROR] [org.gradle.BuildExceptionReporter]  at org.gradle.launcher.daemon.server.exec.EstablishBuildEnvironment.doBuild(EstablishBuildEnvironment.java:61)
15:28:41.761 [ERROR] [org.gradle.BuildExceptionReporter]  at org.gradle.launcher.daemon.server.exec.BuildCommandOnly.execute(BuildCommandOnly.java:34)
15:28:41.762 [ERROR] [org.gradle.BuildExceptionReporter]  at org.gradle.launcher.daemon.server.exec.DaemonCommandExecution.proceed(DaemonCommandExecution.java:122)
15:28:41.762 [ERROR] [org.gradle.BuildExceptionReporter]  at org.gradle.launcher.daemon.server.exec.StartBuildOrRespondWithBusy.doBuild(StartBuildOrRespondWithBusy.java:49)
15:28:41.762 [ERROR] [org.gradle.BuildExceptionReporter]  at org.gradle.launcher.daemon.server.exec.BuildCommandOnly.execute(BuildCommandOnly.java:34)
15:28:41.763 [ERROR] [org.gradle.BuildExceptionReporter]  at org.gradle.launcher.daemon.server.exec.DaemonCommandExecution.proceed(DaemonCommandExecution.java:122)
15:28:41.763 [ERROR] [org.gradle.BuildExceptionReporter]  at org.gradle.launcher.daemon.server.exec.HandleStop.execute(HandleStop.java:36)
15:28:41.763 [ERROR] [org.gradle.BuildExceptionReporter]  at org.gradle.launcher.daemon.server.exec.DaemonCommandExecution.proceed(DaemonCommandExecution.java:122)
15:28:41.763 [ERROR] [org.gradle.BuildExceptionReporter]  at org.gradle.launcher.daemon.server.exec.CatchAndForwardDaemonFailure.execute(CatchAndForwardDaemonFailure.java:32)
15:28:41.764 [ERROR] [org.gradle.BuildExceptionReporter]  at org.gradle.launcher.daemon.server.exec.DaemonCommandExecution.proceed(DaemonCommandExecution.java:122)
15:28:41.764 [ERROR] [org.gradle.BuildExceptionReporter]  at org.gradle.launcher.daemon.server.exec.HandleClientDisconnectBeforeSendingCommand.execute(HandleClientDisconnectBeforeSendingCommand.java:21)
15:28:41.764 [ERROR] [org.gradle.BuildExceptionReporter]  at org.gradle.launcher.daemon.server.exec.DaemonCommandExecution.proceed(DaemonCommandExecution.java:122)
15:28:41.764 [ERROR] [org.gradle.BuildExceptionReporter]  at org.gradle.launcher.daemon.server.exec.StopConnectionAfterExecution.execute(StopConnectionAfterExecution.java:27)
15:28:41.765 [ERROR] [org.gradle.BuildExceptionReporter]  at org.gradle.launcher.daemon.server.exec.DaemonCommandExecution.proceed(DaemonCommandExecution.java:122)
15:28:41.765 [ERROR] [org.gradle.BuildExceptionReporter]  at org.gradle.launcher.daemon.server.exec.DefaultDaemonCommandExecuter.executeCommand(DefaultDaemonCommandExecuter.java:55)
15:28:41.765 [ERROR] [org.gradle.BuildExceptionReporter]  at org.gradle.launcher.daemon.server.Daemon$1$1.run(Daemon.java:123)
15:28:41.765 [ERROR] [org.gradle.BuildExceptionReporter]  at org.gradle.messaging.concurrent.DefaultExecutorFactory$StoppableExecutorImpl$1.run(DefaultExecutorFactory.java:66)
15:28:41.766 [ERROR] [org.gradle.BuildExceptionReporter] Caused by: org.gradle.process.internal.ExecException: Command 'ant' finished with (non-zero) exit value 1.
15:28:41.766 [ERROR] [org.gradle.BuildExceptionReporter]  at org.gradle.process.internal.DefaultExecHandle$ExecResultImpl.assertNormalExitValue(DefaultExecHandle.java:338)
15:28:41.766 [ERROR] [org.gradle.BuildExceptionReporter]  at org.gradle.process.internal.DefaultExecAction.execute(DefaultExecAction.java:39)
15:28:41.766 [ERROR] [org.gradle.BuildExceptionReporter]  at org.gradle.api.tasks.Exec.exec(Exec.java:58)
15:28:41.767 [ERROR] [org.gradle.BuildExceptionReporter]  at org.gradle.api.internal.BeanDynamicObject$MetaClassAdapter.invokeMethod(BeanDynamicObject.java:196)
15:28:41.767 [ERROR] [org.gradle.BuildExceptionReporter]  at org.gradle.api.internal.BeanDynamicObject.invokeMethod(BeanDynamicObject.java:102)
15:28:41.767 [ERROR] [org.gradle.BuildExceptionReporter]  at org.gradle.api.internal.CompositeDynamicObject.invokeMethod(CompositeDynamicObject.java:99)
15:28:41.767 [ERROR] [org.gradle.BuildExceptionReporter]  at org.gradle.api.tasks.Exec_Decorated.invokeMethod(Unknown Source)
15:28:41.768 [ERROR] [org.gradle.BuildExceptionReporter]  at org.gradle.util.ReflectionUtil.invoke(ReflectionUtil.groovy:23)
15:28:41.768 [ERROR] [org.gradle.BuildExceptionReporter]  at org.gradle.api.internal.project.taskfactory.AnnotationProcessingTaskFactory$4.execute(AnnotationProcessingTaskFactory.java:150)
15:28:41.768 [ERROR] [org.gradle.BuildExceptionReporter]  at org.gradle.api.internal.project.taskfactory.AnnotationProcessingTaskFactory$4.execute(AnnotationProcessingTaskFactory.java:145)
15:28:41.769 [ERROR] [org.gradle.BuildExceptionReporter]  at org.gradle.api.internal.AbstractTask$TaskActionWrapper.execute(AbstractTask.java:477)
15:28:41.769 [ERROR] [org.gradle.BuildExceptionReporter]  at org.gradle.api.internal.AbstractTask$TaskActionWrapper.execute(AbstractTask.java:466)
15:28:41.769 [ERROR] [org.gradle.BuildExceptionReporter]  at org.gradle.api.internal.tasks.execution.ExecuteActionsTaskExecuter.executeActions(ExecuteActionsTaskExecuter.java:60)
15:28:41.769 [ERROR] [org.gradle.BuildExceptionReporter]  ... 76 more
15:28:41.770 [ERROR] [org.gradle.BuildExceptionReporter] 
15:28:41.770 [LIFECYCLE] [org.gradle.BuildResultLogger] 
15:28:41.770 [LIFECYCLE] [org.gradle.BuildResultLogger] BUILD FAILED
15:28:41.770 [LIFECYCLE] [org.gradle.BuildResultLogger] 
15:28:41.771 [LIFECYCLE] [org.gradle.BuildResultLogger] Total time: 6.328 secs
15:28:41.771 [DEBUG] [org.gradle.cache.internal.DefaultFileLockManager] Releasing lock on no_buildscript class cache for build file '/home/phil/my_workspace/android_core/docs/build.gradle' (/home/phil/.gradle/caches/1.0-milestone-9/scripts/build_7q7jdptcju47brvj1lb3b1b1e7/ProjectScript/no_buildscript).
15:28:41.772 [DEBUG] [org.gradle.cache.internal.DefaultFileLockManager] Releasing lock on buildscript class cache for build file '/home/phil/my_workspace/android_core/docs/build.gradle' (/home/phil/.gradle/caches/1.0-milestone-9/scripts/build_7q7jdptcju47brvj1lb3b1b1e7/ProjectScript/buildscript).
15:28:41.772 [DEBUG] [org.gradle.cache.internal.DefaultFileLockManager] Releasing lock on no_buildscript class cache for build file '/home/phil/my_workspace/android_core/android_tutorial_teleop/build.gradle' (/home/phil/.gradle/caches/1.0-milestone-9/scripts/build_22u9p24e1hja4vugarj4n4hgeo/ProjectScript/no_buildscript).
15:28:41.772 [DEBUG] [org.gradle.cache.internal.DefaultFileLockManager] Releasing lock on buildscript class cache for build file '/home/phil/my_workspace/android_core/android_tutorial_teleop/build.gradle' (/home/phil/.gradle/caches/1.0-milestone-9/scripts/build_22u9p24e1hja4vugarj4n4hgeo/ProjectScript/buildscript).
15:28:41.773 [DEBUG] [org.gradle.cache.internal.DefaultFileLockManager] Releasing lock on no_buildscript class cache for build file '/home/phil/my_workspace/android_core/android_tutorial_pubsub/build.gradle' (/home/phil/.gradle/caches/1.0-milestone-9/scripts/build_lussub0c7fvqvlql8uc12anfm/ProjectScript/no_buildscript).
15:28:41.773 [DEBUG] [org.gradle.cache.internal.DefaultFileLockManager] Releasing lock on buildscript class cache for build file '/home/phil/my_workspace/android_core/android_tutorial_pubsub/build.gradle' (/home/phil/.gradle/caches/1.0-milestone-9/scripts/build_lussub0c7fvqvlql8uc12anfm/ProjectScript/buildscript).
15:28:41.773 [DEBUG] [org.gradle.cache.internal.DefaultFileLockManager] Releasing lock on no_buildscript class cache for build file '/home/phil/my_workspace/android_core/android_tutorial_image_transport/build.gradle' (/home/phil/.gradle/caches/1.0-milestone-9/scripts/build_4vo47kd5j2hslt74q0nocrqiaa/ProjectScript/no_buildscript).
15:28:41.773 [DEBUG] [org.gradle.cache.internal.DefaultFileLockManager] Releasing lock on buildscript class cache for build file '/home/phil/my_workspace/android_core/android_tutorial_image_transport/build.gradle' (/home/phil/.gradle/caches/1.0-milestone-9/scripts/build_4vo47kd5j2hslt74q0nocrqiaa/ProjectScript/buildscript).
15:28:41.774 [DEBUG] [org.gradle.cache.internal.DefaultFileLockManager] Releasing lock on no_buildscript class cache for build file '/home/phil/my_workspace/android_core/android_tutorial_hokuyo/build.gradle' (/home/phil/.gradle/caches/1.0-milestone-9/scripts/build_5d01p7cl7mufftgbp2dut473ii/ProjectScript/no_buildscript).
15:28:41.774 [DEBUG] [org.gradle.cache.internal.DefaultFileLockManager] Releasing lock on buildscript class cache for build file '/home/phil/my_workspace/android_core/android_tutorial_hokuyo/build.gradle' (/home/phil/.gradle/caches/1.0-milestone-9/scripts/build_5d01p7cl7mufftgbp2dut473ii/ProjectScript/buildscript).
15:28:41.774 [DEBUG] [org.gradle.cache.internal.DefaultFileLockManager] Releasing lock on no_buildscript class cache for build file '/home/phil/my_workspace/android_core/android_tutorial_camera/build.gradle' (/home/phil/.gradle/caches/1.0-milestone-9/scripts/build_2146eignqoht19ghavbt52bq74/ProjectScript/no_buildscript).
15:28:41.775 [DEBUG] [org.gradle.cache.internal.DefaultFileLockManager] Releasing lock on buildscript class cache for build file '/home/phil/my_workspace/android_core/android_tutorial_camera/build.gradle' (/home/phil/.gradle/caches/1.0-milestone-9/scripts/build_2146eignqoht19ghavbt52bq74/ProjectScript/buildscript).
15:28:41.775 [DEBUG] [org.gradle.cache.internal.DefaultFileLockManager] Releasing lock on no_buildscript class cache for build file '/home/phil/my_workspace/android_core/android_honeycomb_mr2/build.gradle' (/home/phil/.gradle/caches/1.0-milestone-9/scripts/build_82be0c8dfoli4o2nh9lopcs2i/ProjectScript/no_buildscript).
15:28:41.775 [DEBUG] [org.gradle.cache.internal.DefaultFileLockManager] Releasing lock on buildscript class cache for build file '/home/phil/my_workspace/android_core/android_honeycomb_mr2/build.gradle' (/home/phil/.gradle/caches/1.0-milestone-9/scripts/build_82be0c8dfoli4o2nh9lopcs2i/ProjectScript/buildscript).
15:28:41.776 [DEBUG] [org.gradle.cache.internal.DefaultFileLockManager] Releasing lock on no_buildscript class cache for build file '/home/phil/my_workspace/android_core/android_gingerbread_mr1/build.gradle' (/home/phil/.gradle/caches/1.0-milestone-9/scripts/build_62uhlgv94ql8iq8gf3qrqgk31c/ProjectScript/no_buildscript).
15:28:41.776 [DEBUG] [org.gradle.cache.internal.DefaultFileLockManager] Releasing lock on buildscript class cache for build file '/home/phil/my_workspace/android_core/android_gingerbread_mr1/build.gradle' (/home/phil/.gradle/caches/1.0-milestone-9/scripts/build_62uhlgv94ql8iq8gf3qrqgk31c/ProjectScript/buildscript).
15:28:41.776 [DEBUG] [org.gradle.cache.internal.DefaultFileLockManager] Releasing lock on no_buildscript class cache for build file '/home/phil/my_workspace/android_core/android_acm_serial/build.gradle' (/home/phil/.gradle/caches/1.0-milestone-9/scripts/build_26ej55opfg6g58efogh00bninr/ProjectScript/no_buildscript).
15:28:41.777 [DEBUG] [org.gradle.cache.internal.DefaultFileLockManager] Releasing lock on buildscript class cache for build file '/home/phil/my_workspace/android_core/android_acm_serial/build.gradle' (/home/phil/.gradle/caches/1.0-milestone-9/scripts/build_26ej55opfg6g58efogh00bninr/ProjectScript/buildscript).
15:28:41.777 [DEBUG] [org.gradle.cache.internal.DefaultFileLockManager] Releasing lock on no_buildscript class cache for build file '/home/phil/my_workspace/android_core/build.gradle' (/home/phil/.gradle/caches/1.0-milestone-9/scripts/build_68iirpc6jfhpncuhilm8rpco43/ProjectScript/no_buildscript).
15:28:41.777 [DEBUG] [org.gradle.cache.internal.DefaultFileLockManager] Releasing lock on buildscript class cache for build file '/home/phil/my_workspace/android_core/build.gradle' (/home/phil/.gradle/caches/1.0-milestone-9/scripts/build_68iirpc6jfhpncuhilm8rpco43/ProjectScript/buildscript).
15:28:41.778 [DEBUG] [org.gradle.cache.internal.DefaultFileLockManager] Releasing lock on no_buildscript class cache for settings file '/home/phil/my_workspace/android_core/settings.gradle' (/home/phil/.gradle/caches/1.0-milestone-9/scripts/settings_2encl08qvt5da2bbg9nk1p4521/SettingsScript/no_buildscript).
15:28:41.778 [DEBUG] [org.gradle.cache.internal.DefaultFileLockManager] Releasing lock on buildscript class cache for settings file '/home/phil/my_workspace/android_core/settings.gradle' (/home/phil/.gradle/caches/1.0-milestone-9/scripts/settings_2encl08qvt5da2bbg9nk1p4521/SettingsScript/buildscript).
15:28:41.780 [DEBUG] [org.gradle.logging.internal.DefaultLoggingConfigurer] Finished configuring with level: DEBUG, configurers: [org.gradle.logging.internal.OutputEventRenderer@2bd1e730, org.gradle.logging.internal.slf4j.Slf4jLoggingConfigurer@61a116c9, org.gradle.logging.internal.JavaUtilLoggingConfigurer@16df1832]
15:28:41.780 [DEBUG] [org.gradle.launcher.daemon.server.exec.ExecuteBuild] The daemon has finished executing the build.
15:28:41.780 [DEBUG] [org.gradle.launcher.daemon.server.exec.ReturnResult] Daemon is dispatching the build result: DaemonCommandResult[type=CommandFailure, value=org.gradle.launcher.exec.ReportedException: org.gradle.api.internal.LocationAwareException: Execution failed for task ':android_honeycomb_mr2:debug'.]
15:28:42.119 [DEBUG] [org.gradle.launcher.daemon.client.DaemonClientInputForwarder] input forwarder stop requested
15:28:42.120 [DEBUG] [org.gradle.launcher.daemon.client.DaemonClientInputForwarder] Dispatching close input message: CloseInput[id=1339529322120-2]