Ask Your Question

Revision history [back]

click to hide/show revision 1
initial version

I have same error. this is my detailed error. My environments and logs are as below.

  • ROS electric
    • ant : 1.8.2
    • android SDK tools(R19)
    • Android 3.2, 3.1, 2.3.3 installed
  • DISTRIB_DESCRIPTION="Ubuntu 11.10"

    Localname S SCM Version-Spec UID (Spec) URI (Spec) (https://...) --------- - ---- ------------ ----------- ------------------------- google hg default 74f72f400c60 code.google.com/p/rosjava.google android_core M hg default d06d044d3d57 code.google.com/p/rosjava.android rosjava_android M hg d06d044d3d57 code.google.com/p/rosjava.android rosjava_core hg c8b056520989 rosjava.googlecode.com/hg


   11:22:44.249 [QUIET] [system.out] Buildfile: /opt/rocon/android_core/android_honeycomb_mr2/build.xml
    11:22:44.781 [QUIET] [system.out] 
    11:22:44.781 [QUIET] [system.out] -set-mode-check:
    11:22:44.782 [QUIET] [system.out] 
    11:22:44.782 [QUIET] [system.out] -set-debug-files:
    11:22:44.782 [QUIET] [system.out] 
    11:22:44.783 [QUIET] [system.out] -set-debug-mode:
    11:22:44.783 [QUIET] [system.out] 
    11:22:44.783 [QUIET] [system.out] -debug-obfuscation-check:
    11:22:44.784 [QUIET] [system.out] 
    11:22:44.784 [QUIET] [system.out] -setup:
    11:22:44.792 [QUIET] [system.out]      [echo] Creating output directories if needed...
    11:22:44.794 [QUIET] [system.out]      [echo] Gathering info for android_honeycomb_mr2...
    11:22:44.797 [QUIET] [system.out]     [setup] Android SDK Tools Revision 19
    11:22:44.839 [QUIET] [system.out]     [setup] Project Target: Android 3.2
    11:22:44.840 [QUIET] [system.out]     [setup] API level: 13
    11:22:44.840 [QUIET] [system.out]     [setup] Project Type: Android Library
    11:22:44.840 [QUIET] [system.out]     [setup] 
    11:22:44.841 [QUIET] [system.out]     [setup] ------------------
    11:22:44.841 [QUIET] [system.out]     [setup] Resolving library dependencies:
    11:22:44.842 [QUIET] [system.out]     [setup] /opt/rocon/android_core/android_honeycomb_mr2: ../android_gingerbread => /opt/rocon/android_core/android_gingerbread
    11:22:44.844 [QUIET] [system.out]     [setup] ------------------
    11:22:44.844 [QUIET] [system.out]     [setup] Ordered libraries:
    11:22:44.845 [QUIET] [system.out]     [setup] /opt/rocon/android_core/android_gingerbread
    11:22:44.904 [QUIET] [system.out]     [setup] 
    11:22:44.905 [QUIET] [system.out]     [setup] ------------------
    11:22:44.905 [QUIET] [system.out]     [setup] API<=15: Adding annotations.jar to the classpath.
    11:22:44.905 [QUIET] [system.out]     [setup] 
    11:22:44.906 [QUIET] [system.out]     [setup] ------------------
    11:22:44.929 [QUIET] [system.out] 
    11:22:44.930 [QUIET] [system.out] -build-setup:
    11:22:44.932 [QUIET] [system.out]      [echo] Building Libraries
    11:22:45.043 [QUIET] [system.out] 
    11:22:45.043 [QUIET] [system.out] nodeps:
    11:22:45.044 [QUIET] [system.out] 
    11:22:45.044 [QUIET] [system.out] -set-mode-check:
    11:22:45.044 [QUIET] [system.out] 
    11:22:45.044 [QUIET] [system.out] -set-debug-files:
    11:22:45.044 [QUIET] [system.out] 
    11:22:45.045 [QUIET] [system.out] -set-debug-mode:
    11:22:45.045 [QUIET] [system.out] 
    11:22:45.045 [QUIET] [system.out] -debug-obfuscation-check:
    11:22:45.045 [QUIET] [system.out] 
    11:22:45.045 [QUIET] [system.out] -setup:
    11:22:45.046 [QUIET] [system.out]      [echo] Creating output directories if needed...
    11:22:45.046 [QUIET] [system.out]      [echo] Gathering info for android_gingerbread...
    11:22:45.047 [QUIET] [system.out]     [setup] Android SDK Tools Revision 19
    11:22:45.071 [QUIET] [system.out]     [setup] Project Target: Android 2.3.3
    11:22:45.071 [QUIET] [system.out]     [setup] API level: 10
    11:22:45.072 [QUIET] [system.out]     [setup] Project Type: Android Library
    11:22:45.072 [QUIET] [system.out]     [setup] 
    11:22:45.072 [QUIET] [system.out]     [setup] ------------------
    11:22:45.072 [QUIET] [system.out]     [setup] Resolving library dependencies:
    11:22:45.072 [QUIET] [system.out]     [setup] No library dependencies.
    11:22:45.073 [QUIET] [system.out]     [setup] 
    11:22:45.073 [QUIET] [system.out]     [setup] ------------------
    11:22:45.073 [QUIET] [system.out]     [setup] API<=15: Adding annotations.jar to the classpath.
    11:22:45.073 [QUIET] [system.out]     [setup] 
    11:22:45.073 [QUIET] [system.out]     [setup] ------------------
    11:22:45.085 [QUIET] [system.out] 
    11:22:45.085 [QUIET] [system.out] -build-setup:
    11:22:45.093 [QUIET] [system.out] 
    11:22:45.093 [QUIET] [system.out] -pre-build:
    11:22:45.094 [QUIET] [system.out] 
    11:22:45.094 [QUIET] [system.out] -code-gen:
    11:22:45.094 [QUIET] [system.out]      [echo] ----------
    11:22:45.094 [QUIET] [system.out]      [echo] Handling aidl files...
    11:22:45.107 [QUIET] [system.out]      [aidl] No AIDL files to compile.
    11:22:45.107 [QUIET] [system.out]      [echo] ----------
    11:22:45.107 [QUIET] [system.out]      [echo] Handling RenderScript files...
    11:22:45.115 [QUIET] [system.out] [renderscript] No RenderScript files to compile.
    11:22:45.115 [QUIET] [system.out]      [echo] ----------
    11:22:45.116 [QUIET] [system.out]      [echo] Handling Resources...
    11:22:45.126 [QUIET] [system.out]      [aapt] No changed resources. R.java and Manifest.java untouched.
    11:22:45.126 [QUIET] [system.out]      [echo] ----------
    11:22:45.126 [QUIET] [system.out]      [echo] Handling BuildConfig class...
    11:22:45.133 [QUIET] [system.out] [buildconfig] No need to generate new BuildConfig.
    11:22:45.133 [QUIET] [system.out] 
    11:22:45.134 [QUIET] [system.out] -pre-compile:
    11:22:45.134 [QUIET] [system.out] 
    11:22:45.134 [QUIET] [system.out] -compile:
    11:22:45.180 [QUIET] [system.out]      [echo] Creating library output jar file...
    11:22:45.227 [QUIET] [system.out] 
    11:22:45.227 [QUIET] [system.out] -post-compile:
    11:22:45.227 [QUIET] [system.out] 
    11:22:45.227 [QUIET] [system.out] -obfuscate:
    11:22:45.227 [QUIET] [system.out] 
    11:22:45.228 [QUIET] [system.out] -dex:
    11:22:45.228 [QUIET] [system.out]      [echo] Library project: do not convert bytecode...
    11:22:45.228 [QUIET] [system.out] 
    11:22:45.228 [QUIET] [system.out] -crunch:
    11:22:45.252 [QUIET] [system.out]    [crunch] Crunching PNG Files in source dir: /opt/rocon/android_core/android_gingerbread/res
    11:22:45.252 [QUIET] [system.out]    [crunch] To destination dir: /opt/rocon/android_core/android_gingerbread/bin/res
    11:22:45.252 [QUIET] [system.out]    [crunch] Crunched 0 PNG files to update cache
    11:22:45.654 [QUIET] [system.out] 
    11:22:45.655 [QUIET] [system.out] -package-resources:
    11:22:45.659 [QUIET] [system.out]      [echo] Library project: do not package resources...
    11:22:45.660 [QUIET] [system.out] 
    11:22:45.660 [QUIET] [system.out] -package:
    11:22:45.660 [QUIET] [system.out]      [echo] Library project: do not package apk...
    11:22:45.661 [QUIET] [system.out] 
    11:22:45.661 [QUIET] [system.out] -post-package:
    11:22:45.661 [QUIET] [system.out] 
    11:22:45.661 [QUIET] [system.out] -do-debug:
    11:22:45.661 [QUIET] [system.out]      [echo] Library project: do not create apk...
    11:22:45.667 [QUIET] [system.out] [propertyfile] Updating property file: /opt/rocon/android_core/android_gingerbread/bin/build.prop
    11:22:45.676 [QUIET] [system.out] [propertyfile] Updating property file: /opt/rocon/android_core/android_gingerbread/bin/build.prop
    11:22:45.678 [QUIET] [system.out] [propertyfile] Updating property file: /opt/rocon/android_core/android_gingerbread/bin/build.prop
    11:22:45.681 [QUIET] [system.out] [propertyfile] Updating property file: /opt/rocon/android_core/android_gingerbread/bin/build.prop
    11:22:45.683 [QUIET] [system.out] 
    11:22:45.683 [QUIET] [system.out] -post-build:
    11:22:45.683 [QUIET] [system.out] 
    11:22:45.684 [QUIET] [system.out] debug:
    11:22:45.684 [QUIET] [system.out]      [echo] 
    11:22:45.684 [QUIET] [system.out]      [echo] ############################################
    11:22:45.684 [QUIET] [system.out]      [echo] **** Back to project android_honeycomb_mr2 ****
    11:22:45.685 [QUIET] [system.out]      [echo] ############################################
    11:22:45.689 [QUIET] [system.out] 
    11:22:45.689 [QUIET] [system.out] -pre-build:
    11:22:45.690 [QUIET] [system.out] 
    11:22:45.690 [QUIET] [system.out] -code-gen:
    11:22:45.690 [QUIET] [system.out]      [echo] ----------
    11:22:45.690 [QUIET] [system.out]      [echo] Handling aidl files...
    11:22:45.699 [QUIET] [system.out]      [aidl] No AIDL files to compile.
    11:22:45.699 [QUIET] [system.out]      [echo] ----------
    11:22:45.699 [QUIET] [system.out]      [echo] Handling RenderScript files...
    11:22:45.708 [QUIET] [system.out] [renderscript] No RenderScript files to compile.
    11:22:45.709 [QUIET] [system.out]      [echo] ----------
    11:22:45.709 [QUIET] [system.out]      [echo] Handling Resources...
    11:22:45.716 [QUIET] [system.out]      [aapt] No changed resources. R.java and Manifest.java untouched.
    11:22:45.717 [QUIET] [system.out]      [echo] ----------
    11:22:45.717 [QUIET] [system.out]      [echo] Handling BuildConfig class...
    11:22:45.720 [QUIET] [system.out] [buildconfig] Generating BuildConfig class.
    11:22:45.721 [QUIET] [system.out] 
    11:22:45.722 [QUIET] [system.out] -pre-compile:
    11:22:45.722 [QUIET] [system.out] 
    11:22:45.722 [QUIET] [system.out] -compile:
    11:22:45.743 [QUIET] [system.out]     [javac] Compiling 41 source files to /opt/rocon/android_core/android_honeycomb_mr2/bin/classes
    11:22:46.466 [QUIET] [system.out]     [javac] /opt/rocon/android_core/android_honeycomb_mr2/src/org/ros/android/view/visualization/layer/CompressedBitmapLayer.java:42: package compressed_visualization_transport_msgs does not exist
    11:22:46.466 [QUIET] [system.out]     [javac]     SubscriberLayer<compressed_visualization_transport_msgs.CompressedBitmap> implements TfLayer {
    11:22:46.467 [QUIET] [system.out]     [javac]                                                            ^
    11:22:46.467 [QUIET] [system.out]     [javac] /opt/rocon/android_core/android_honeycomb_mr2/src/org/ros/android/view/visualization/layer/CompressedBitmapLayer.java:85: package compressed_visualization_transport_msgs does not exist
    11:22:46.467 [QUIET] [system.out]     [javac]   void update(compressed_visualization_transport_msgs.CompressedBitmap compressedBitmap) {
    11:22:46.468 [QUIET] [system.out]     [javac]                                                      ^
    11:22:46.610 [QUIET] [system.out]     [javac] /opt/rocon/android_core/android_honeycomb_mr2/src/org/ros/android/view/visualization/layer/CompressedBitmapLayer.java:72: package compressed_visualization_transport_msgs does not exist
    11:22:46.610 [QUIET] [system.out]     [javac]     Subscriber<compressed_visualization_transport_msgs.CompressedBitmap> subscriber =
    11:22:46.610 [QUIET] [system.out]     [javac]                                                       ^
    11:22:46.611 [QUIET] [system.out]     [javac] /opt/rocon/android_core/android_honeycomb_mr2/src/org/ros/android/view/visualization/layer/CompressedBitmapLayer.java:76: package compressed_visualization_transport_msgs does not exist
    11:22:46.611 [QUIET] [system.out]     [javac]         .addMessageListener(new MessageListener<compressed_visualization_transport_msgs.CompressedBitmap>() {
    11:22:46.611 [QUIET] [system.out]     [javac]                                                                                        ^
    11:22:46.611 [QUIET] [system.out]     [javac] /opt/rocon/android_core/android_honeycomb_mr2/src/org/ros/android/view/visualization/layer/CompressedBitmapLayer.java:79: package compressed_visualization_transport_msgs does not exist
    11:22:46.611 [QUIET] [system.out]     [javac]               compressed_visualization_transport_msgs.CompressedBitmap compressedBitmap) {
    11:22:46.612 [QUIET] [system.out]     [javac]                                                      ^
    11:22:46.648 [QUIET] [system.out]     [javac] 5 errors
    11:22:46.649 [ERROR] [system.err] 
    11:22:46.649 [ERROR] [system.err] BUILD FAILED
    11:22:46.649 [ERROR] [system.err] /opt/android-sdk-linux_x86/tools/ant/build.xml:651: The following error occurred while executing this line:
    11:22:46.649 [ERROR] [system.err] /opt/android-sdk-linux_x86/tools/ant/build.xml:672: Compile failed; see the compiler error output for details.
    11:22:46.650 [ERROR] [system.err] 
    11:22:46.650 [ERROR] [system.err] Total time: 2 seconds
    11:22:46.728 [DEBUG] [org.gradle.process.internal.DefaultExecHandle] Process finished (code: 1) for command 'ant'.
    11:22:46.729 [DEBUG] [org.gradle.logging.internal.DefaultLoggingConfigurer] Finished configuring with level: DEBUG, configurers: [org.gradle.logging.internal.OutputEventRenderer@14e8cee, org.gradle.logging.internal.slf4j.Slf4jLoggingConfigurer@67064, org.gradle.logging.internal.JavaUtilLoggingConfigurer@bcda2d]
    11:22:46.730 [DEBUG] [org.gradle.api.internal.tasks.execution.ExecuteAtMostOnceTaskExecuter] Finished executing task ':android_honeycomb_mr2:debug'
    11:22:46.732 [ERROR] [org.gradle.BuildExceptionReporter] 
    11:22:46.733 [ERROR] [org.gradle.BuildExceptionReporter] FAILURE: Build failed with an exception.
    11:22:46.734 [ERROR] [org.gradle.BuildExceptionReporter] 
    11:22:46.735 [ERROR] [org.gradle.BuildExceptionReporter] * What went wrong:
    11:22:46.735 [ERROR] [org.gradle.BuildExceptionReporter] Execution failed for task ':android_honeycomb_mr2:debug'.
    11:22:46.736 [ERROR] [org.gradle.BuildExceptionReporter] > Command 'ant' finished with (non-zero) exit value 1.
    11:22:46.736 [ERROR] [org.gradle.BuildExceptionReporter] 
    11:22:46.736 [ERROR] [org.gradle.BuildExceptionReporter] * Exception is:
    11:22:46.737 [ERROR] [org.gradle.BuildExceptionReporter] org.gradle.api.tasks.TaskExecutionException: Execution failed for task ':android_honeycomb_mr2:debug'.
    11:22:46.737 [ERROR] [org.gradle.BuildExceptionReporter]    at org.gradle.api.internal.tasks.execution.ExecuteActionsTaskExecuter.executeActions(ExecuteActionsTaskExecuter.java:68)
    11:22:46.738 [ERROR] [org.gradle.BuildExceptionReporter]    at org.gradle.api.internal.tasks.execution.ExecuteActionsTaskExecuter.execute(ExecuteActionsTaskExecuter.java:46)
    11:22:46.738 [ERROR] [org.gradle.BuildExceptionReporter]    at org.gradle.api.internal.tasks.execution.PostExecutionAnalysisTaskExecuter.execute(PostExecutionAnalysisTaskExecuter.java:34)
    11:22:46.738 [ERROR] [org.gradle.BuildExceptionReporter]    at org.gradle.api.internal.changedetection.CacheLockHandlingTaskExecuter$1.run(CacheLockHandlingTaskExecuter.java:34)
    11:22:46.738 [ERROR] [org.gradle.BuildExceptionReporter]    at org.gradle.cache.internal.DefaultCacheAccess$2.create(DefaultCacheAccess.java:200)
    11:22:46.739 [ERROR] [org.gradle.BuildExceptionReporter]    at org.gradle.cache.internal.DefaultCacheAccess.longRunningOperation(DefaultCacheAccess.java:172)
    11:22:46.739 [ERROR] [org.gradle.BuildExceptionReporter]    at org.gradle.cache.internal.DefaultCacheAccess.longRunningOperation(DefaultCacheAccess.java:198)
    11:22:46.739 [ERROR] [org.gradle.BuildExceptionReporter]    at org.gradle.cache.internal.DefaultPersistentDirectoryStore.longRunningOperation(DefaultPersistentDirectoryStore.java:111)
    11:22:46.739 [ERROR] [org.gradle.BuildExceptionReporter]    at org.gradle.api.internal.changedetection.DefaultTaskArtifactStateCacheAccess.longRunningOperation(DefaultTaskArtifactStateCacheAccess.java:83)
    11:22:46.740 [ERROR] [org.gradle.BuildExceptionReporter]    at org.gradle.api.internal.changedetection.CacheLockHandlingTaskExecuter.execute(CacheLockHandlingTaskExecuter.java:32)
    11:22:46.740 [ERROR] [org.gradle.BuildExceptionReporter]    at org.gradle.api.internal.tasks.execution.SkipUpToDateTaskExecuter.execute(SkipUpToDateTaskExecuter.java:55)
    11:22:46.740 [ERROR] [org.gradle.BuildExceptionReporter]    at org.gradle.api.internal.tasks.execution.ValidatingTaskExecuter.execute(ValidatingTaskExecuter.java:57)
    11:22:46.741 [ERROR] [org.gradle.BuildExceptionReporter]    at org.gradle.api.internal.tasks.execution.SkipEmptySourceFilesTaskExecuter.execute(SkipEmptySourceFilesTaskExecuter.java:41)
    11:22:46.741 [ERROR] [org.gradle.BuildExceptionReporter]    at org.gradle.api.internal.tasks.execution.SkipTaskWithNoActionsExecuter.execute(SkipTaskWithNoActionsExecuter.java:51)
    11:22:46.741 [ERROR] [org.gradle.BuildExceptionReporter]    at org.gradle.api.internal.tasks.execution.SkipOnlyIfTaskExecuter.execute(SkipOnlyIfTaskExecuter.java:52)
    11:22:46.742 [ERROR] [org.gradle.BuildExceptionReporter]    at org.gradle.api.internal.tasks.execution.ExecuteAtMostOnceTaskExecuter.execute(ExecuteAtMostOnceTaskExecuter.java:42)
    11:22:46.742 [ERROR] [org.gradle.BuildExceptionReporter]    at org.gradle.api.internal.AbstractTask.executeWithoutThrowingTaskFailure(AbstractTask.java:247)
    11:22:46.743 [ERROR] [org.gradle.BuildExceptionReporter]    at org.gradle.execution.DefaultTaskGraphExecuter.executeTask(DefaultTaskGraphExecuter.java:192)
    11:22:46.743 [ERROR] [org.gradle.BuildExceptionReporter]    at org.gradle.execution.DefaultTaskGraphExecuter.doExecute(DefaultTaskGraphExecuter.java:177)
    11:22:46.743 [ERROR] [org.gradle.BuildExceptionReporter]    at org.gradle.execution.DefaultTaskGraphExecuter.execute(DefaultTaskGraphExecuter.java:83)
    11:22:46.744 [ERROR] [org.gradle.BuildExceptionReporter]    at org.gradle.execution.SelectedTaskExecutionAction.execute(SelectedTaskExecutionAction.java:36)
    11:22:46.744 [ERROR] [org.gradle.BuildExceptionReporter]    at org.gradle.execution.DefaultBuildExecuter.execute(DefaultBuildExecuter.java:61)
    11:22:46.745 [ERROR] [org.gradle.BuildExceptionReporter]    at org.gradle.execution.DefaultBuildExecuter.access$200(DefaultBuildExecuter.java:23)
    11:22:46.745 [ERROR] [org.gradle.BuildExceptionReporter]    at org.gradle.execution.DefaultBuildExecuter$2.proceed(DefaultBuildExecuter.java:67)
    11:22:46.746 [ERROR] [org.gradle.BuildExceptionReporter]    at org.gradle.api.internal.changedetection.TaskCacheLockHandlingBuildExecuter$1.run(TaskCacheLockHandlingBuildExecuter.java:31)
    11:22:46.746 [ERROR] [org.gradle.BuildExceptionReporter]    at org.gradle.cache.internal.DefaultCacheAccess$1.create(DefaultCacheAccess.java:111)
    11:22:46.746 [ERROR] [org.gradle.BuildExceptionReporter]    at org.gradle.cache.internal.DefaultCacheAccess.useCache(DefaultCacheAccess.java:126)
    11:22:46.747 [ERROR] [org.gradle.BuildExceptionReporter]    at org.gradle.cache.internal.DefaultCacheAccess.useCache(DefaultCacheAccess.java:109)
    11:22:46.747 [ERROR] [org.gradle.BuildExceptionReporter]    at org.gradle.cache.internal.DefaultPersistentDirectoryStore.useCache(DefaultPersistentDirectoryStore.java:103)
    11:22:46.747 [ERROR] [org.gradle.BuildExceptionReporter]    at org.gradle.api.internal.changedetection.DefaultTaskArtifactStateCacheAccess.useCache(DefaultTaskArtifactStateCacheAccess.java:79)
    11:22:46.747 [ERROR] [org.gradle.BuildExceptionReporter]    at org.gradle.api.internal.changedetection.TaskCacheLockHandlingBuildExecuter.execute(TaskCacheLockHandlingBuildExecuter.java:29)
    11:22:46.748 [ERROR] [org.gradle.BuildExceptionReporter]    at org.gradle.execution.DefaultBuildExecuter.execute(DefaultBuildExecuter.java:61)
    11:22:46.748 [ERROR] [org.gradle.BuildExceptionReporter]    at org.gradle.execution.DefaultBuildExecuter.access$200(DefaultBuildExecuter.java:23)
    11:22:46.748 [ERROR] [org.gradle.BuildExceptionReporter]    at org.gradle.execution.DefaultBuildExecuter$2.proceed(DefaultBuildExecuter.java:67)
    11:22:46.749 [ERROR] [org.gradle.BuildExceptionReporter]    at org.gradle.execution.DryRunBuildExecutionAction.execute(DryRunBuildExecutionAction.java:32)
    11:22:46.749 [ERROR] [org.gradle.BuildExceptionReporter]    at org.gradle.execution.DefaultBuildExecuter.execute(DefaultBuildExecuter.java:61)
    11:22:46.749 [ERROR] [org.gradle.BuildExceptionReporter]    at org.gradle.execution.DefaultBuildExecuter.execute(DefaultBuildExecuter.java:54)
    11:22:46.749 [ERROR] [org.gradle.BuildExceptionReporter]    at org.gradle.initialization.DefaultGradleLauncher.doBuildStages(DefaultGradleLauncher.java:155)
    11:22:46.750 [ERROR] [org.gradle.BuildExceptionReporter]    at org.gradle.initialization.DefaultGradleLauncher.doBuild(DefaultGradleLauncher.java:110)
    11:22:46.750 [ERROR] [org.gradle.BuildExceptionReporter]    at org.gradle.initialization.DefaultGradleLauncher.run(DefaultGradleLauncher.java:78)
    11:22:46.750 [ERROR] [org.gradle.BuildExceptionReporter]    at org.gradle.launcher.cli.ExecuteBuildAction.run(ExecuteBuildAction.java:45)
    11:22:46.751 [ERROR] [org.gradle.BuildExceptionReporter]    at org.gradle.launcher.daemon.protocol.Build.run(Build.java:67)
    11:22:46.751 [ERROR] [org.gradle.BuildExceptionReporter]    at org.gradle.launcher.daemon.protocol.Build.run(Build.java:63)
    11:22:46.751 [ERROR] [org.gradle.BuildExceptionReporter]    at org.gradle.launcher.daemon.server.exec.ExecuteBuild.doBuild(ExecuteBuild.java:45)
    11:22:46.751 [ERROR] [org.gradle.BuildExceptionReporter]    at org.gradle.launcher.daemon.server.exec.BuildCommandOnly.execute(BuildCommandOnly.java:34)
    11:22:46.752 [ERROR] [org.gradle.BuildExceptionReporter]    at org.gradle.launcher.daemon.server.exec.DaemonCommandExecution.proceed(DaemonCommandExecution.java:122)
    11:22:46.752 [ERROR] [org.gradle.BuildExceptionReporter]    at org.gradle.launcher.daemon.server.exec.WatchForDisconnection.execute(WatchForDisconnection.java:45)
    11:22:46.752 [ERROR] [org.gradle.BuildExceptionReporter]    at org.gradle.launcher.daemon.server.exec.DaemonCommandExecution.proceed(DaemonCommandExecution.java:122)
    11:22:46.753 [ERROR] [org.gradle.BuildExceptionReporter]    at org.gradle.launcher.daemon.server.exec.ResetDeprecationLogger.execute(ResetDeprecationLogger.java:24)
    11:22:46.753 [ERROR] [org.gradle.BuildExceptionReporter]    at org.gradle.launcher.daemon.server.exec.DaemonCommandExecution.proceed(DaemonCommandExecution.java:122)
    11:22:46.753 [ERROR] [org.gradle.BuildExceptionReporter]    at org.gradle.launcher.daemon.server.exec.ReturnResult.execute(ReturnResult.java:34)
    11:22:46.753 [ERROR] [org.gradle.BuildExceptionReporter]    at org.gradle.launcher.daemon.server.exec.DaemonCommandExecution.proceed(DaemonCommandExecution.java:122)
    11:22:46.754 [ERROR] [org.gradle.BuildExceptionReporter]    at org.gradle.launcher.daemon.server.exec.ForwardClientInput$4.call(ForwardClientInput.java:116)
    11:22:46.754 [ERROR] [org.gradle.BuildExceptionReporter]    at org.gradle.launcher.daemon.server.exec.ForwardClientInput$4.call(ForwardClientInput.java:114)
    11:22:46.754 [ERROR] [org.gradle.BuildExceptionReporter]    at org.gradle.util.Swapper.swap(Swapper.java:38)
    11:22:46.754 [ERROR] [org.gradle.BuildExceptionReporter]    at org.gradle.launcher.daemon.server.exec.ForwardClientInput.execute(ForwardClientInput.java:114)
    11:22:46.755 [ERROR] [org.gradle.BuildExceptionReporter]    at org.gradle.launcher.daemon.server.exec.DaemonCommandExecution.proceed(DaemonCommandExecution.java:122)
    11:22:46.755 [ERROR] [org.gradle.BuildExceptionReporter]    at org.gradle.launcher.daemon.server.exec.LogToClient.doBuild(LogToClient.java:60)
    11:22:46.755 [ERROR] [org.gradle.BuildExceptionReporter]    at org.gradle.launcher.daemon.server.exec.BuildCommandOnly.execute(BuildCommandOnly.java:34)
    11:22:46.755 [ERROR] [org.gradle.BuildExceptionReporter]    at org.gradle.launcher.daemon.server.exec.DaemonCommandExecution.proceed(DaemonCommandExecution.java:122)
    11:22:46.756 [ERROR] [org.gradle.BuildExceptionReporter]    at org.gradle.launcher.daemon.server.exec.EstablishBuildEnvironment.doBuild(EstablishBuildEnvironment.java:61)
    11:22:46.756 [ERROR] [org.gradle.BuildExceptionReporter]    at org.gradle.launcher.daemon.server.exec.BuildCommandOnly.execute(BuildCommandOnly.java:34)
    11:22:46.756 [ERROR] [org.gradle.BuildExceptionReporter]    at org.gradle.launcher.daemon.server.exec.DaemonCommandExecution.proceed(DaemonCommandExecution.java:122)
    11:22:46.757 [ERROR] [org.gradle.BuildExceptionReporter]    at org.gradle.launcher.daemon.server.exec.StartBuildOrRespondWithBusy.doBuild(StartBuildOrRespondWithBusy.java:49)
    11:22:46.757 [ERROR] [org.gradle.BuildExceptionReporter]    at org.gradle.launcher.daemon.server.exec.BuildCommandOnly.execute(BuildCommandOnly.java:34)
    11:22:46.757 [ERROR] [org.gradle.BuildExceptionReporter]    at org.gradle.launcher.daemon.server.exec.DaemonCommandExecution.proceed(DaemonCommandExecution.java:122)
    11:22:46.757 [ERROR] [org.gradle.BuildExceptionReporter]    at org.gradle.launcher.daemon.server.exec.HandleStop.execute(HandleStop.java:36)
    11:22:46.758 [ERROR] [org.gradle.BuildExceptionReporter]    at org.gradle.launcher.daemon.server.exec.DaemonCommandExecution.proceed(DaemonCommandExecution.java:122)
    11:22:46.758 [ERROR] [org.gradle.BuildExceptionReporter]    at org.gradle.launcher.daemon.server.exec.CatchAndForwardDaemonFailure.execute(CatchAndForwardDaemonFailure.java:32)
    11:22:46.758 [ERROR] [org.gradle.BuildExceptionReporter]    at org.gradle.launcher.daemon.server.exec.DaemonCommandExecution.proceed(DaemonCommandExecution.java:122)
    11:22:46.758 [ERROR] [org.gradle.BuildExceptionReporter]    at org.gradle.launcher.daemon.server.exec.HandleClientDisconnectBeforeSendingCommand.execute(HandleClientDisconnectBeforeSendingCommand.java:21)
    11:22:46.759 [ERROR] [org.gradle.BuildExceptionReporter]    at org.gradle.launcher.daemon.server.exec.DaemonCommandExecution.proceed(DaemonCommandExecution.java:122)
    11:22:46.759 [ERROR] [org.gradle.BuildExceptionReporter]    at org.gradle.launcher.daemon.server.exec.StopConnectionAfterExecution.execute(StopConnectionAfterExecution.java:27)
    11:22:46.759 [ERROR] [org.gradle.BuildExceptionReporter]    at org.gradle.launcher.daemon.server.exec.DaemonCommandExecution.proceed(DaemonCommandExecution.java:122)
    11:22:46.760 [ERROR] [org.gradle.BuildExceptionReporter]    at org.gradle.launcher.daemon.server.exec.DefaultDaemonCommandExecuter.executeCommand(DefaultDaemonCommandExecuter.java:55)
    11:22:46.760 [ERROR] [org.gradle.BuildExceptionReporter]    at org.gradle.launcher.daemon.server.Daemon$1$1.run(Daemon.java:123)
    11:22:46.760 [ERROR] [org.gradle.BuildExceptionReporter]    at org.gradle.messaging.concurrent.DefaultExecutorFactory$StoppableExecutorImpl$1.run(DefaultExecutorFactory.java:66)
    11:22:46.760 [ERROR] [org.gradle.BuildExceptionReporter] Caused by: org.gradle.process.internal.ExecException: Command 'ant' finished with (non-zero) exit value 1.
    11:22:46.761 [ERROR] [org.gradle.BuildExceptionReporter]    at org.gradle.process.internal.DefaultExecHandle$ExecResultImpl.assertNormalExitValue(DefaultExecHandle.java:338)
    11:22:46.761 [ERROR] [org.gradle.BuildExceptionReporter]    at org.gradle.process.internal.DefaultExecAction.execute(DefaultExecAction.java:39)
    11:22:46.761 [ERROR] [org.gradle.BuildExceptionReporter]    at org.gradle.api.tasks.Exec.exec(Exec.java:58)
    11:22:46.761 [ERROR] [org.gradle.BuildExceptionReporter]    at org.gradle.api.internal.BeanDynamicObject$MetaClassAdapter.invokeMethod(BeanDynamicObject.java:196)
    11:22:46.762 [ERROR] [org.gradle.BuildExceptionReporter]    at org.gradle.api.internal.BeanDynamicObject.invokeMethod(BeanDynamicObject.java:102)
    11:22:46.762 [ERROR] [org.gradle.BuildExceptionReporter]    at org.gradle.api.internal.CompositeDynamicObject.invokeMethod(CompositeDynamicObject.java:99)
    11:22:46.762 [ERROR] [org.gradle.BuildExceptionReporter]    at org.gradle.api.tasks.Exec_Decorated.invokeMethod(Unknown Source)
    11:22:46.763 [ERROR] [org.gradle.BuildExceptionReporter]    at org.gradle.util.ReflectionUtil.invoke(ReflectionUtil.groovy:23)
    11:22:46.763 [ERROR] [org.gradle.BuildExceptionReporter]    at org.gradle.api.internal.project.taskfactory.AnnotationProcessingTaskFactory$4.execute(AnnotationProcessingTaskFactory.java:150)
    11:22:46.763 [ERROR] [org.gradle.BuildExceptionReporter]    at org.gradle.api.internal.project.taskfactory.AnnotationProcessingTaskFactory$4.execute(AnnotationProcessingTaskFactory.java:145)
    11:22:46.764 [ERROR] [org.gradle.BuildExceptionReporter]    at org.gradle.api.internal.AbstractTask$TaskActionWrapper.execute(AbstractTask.java:477)
    11:22:46.764 [ERROR] [org.gradle.BuildExceptionReporter]    at org.gradle.api.internal.AbstractTask$TaskActionWrapper.execute(AbstractTask.java:466)
    11:22:46.764 [ERROR] [org.gradle.BuildExceptionReporter]    at org.gradle.api.internal.tasks.execution.ExecuteActionsTaskExecuter.executeActions(ExecuteActionsTaskExecuter.java:60)
    11:22:46.764 [ERROR] [org.gradle.BuildExceptionReporter]    ... 76 more
    11:22:46.765 [ERROR] [org.gradle.BuildExceptionReporter] 
    11:22:46.767 [LIFECYCLE] [org.gradle.BuildResultLogger] 
    11:22:46.767 [LIFECYCLE] [org.gradle.BuildResultLogger] BUILD FAILED
    11:22:46.768 [LIFECYCLE] [org.gradle.BuildResultLogger] 
    11:22:46.768 [LIFECYCLE] [org.gradle.BuildResultLogger] Total time: 6.52 secs
    11:22:46.768 [DEBUG] [org.gradle.cache.internal.DefaultFileLockManager] Releasing lock on no_buildscript class cache for build file '/opt/rocon/android_core/docs/build.gradle' (/home/hughie/.gradle/caches/1.0-milestone-9/scripts/build_peoaba3uu8690sulg51o9m3e3/ProjectScript/no_buildscript).
    11:22:46.769 [DEBUG] [org.gradle.cache.internal.DefaultFileLockManager] Releasing lock on buildscript class cache for build file '/opt/rocon/android_core/docs/build.gradle' (/home/hughie/.gradle/caches/1.0-milestone-9/scripts/build_peoaba3uu8690sulg51o9m3e3/ProjectScript/buildscript).
    11:22:46.769 [DEBUG] [org.gradle.cache.internal.DefaultFileLockManager] Releasing lock on no_buildscript class cache for build file '/opt/rocon/android_core/android_tutorial_teleop/build.gradle' (/home/hughie/.gradle/caches/1.0-milestone-9/scripts/build_6aa7jlhi8f5q2s40ie261oeu1m/ProjectScript/no_buildscript).
    11:22:46.769 [DEBUG] [org.gradle.cache.internal.DefaultFileLockManager] Releasing lock on buildscript class cache for build file '/opt/rocon/android_core/android_tutorial_teleop/build.gradle' (/home/hughie/.gradle/caches/1.0-milestone-9/scripts/build_6aa7jlhi8f5q2s40ie261oeu1m/ProjectScript/buildscript).
    11:22:46.770 [DEBUG] [org.gradle.cache.internal.DefaultFileLockManager] Releasing lock on no_buildscript class cache for build file '/opt/rocon/android_core/android_tutorial_pubsub/build.gradle' (/home/hughie/.gradle/caches/1.0-milestone-9/scripts/build_74tnttb52qlgnvh83og6q53b66/ProjectScript/no_buildscript).
    11:22:46.770 [DEBUG] [org.gradle.cache.internal.DefaultFileLockManager] Releasing lock on buildscript class cache for build file '/opt/rocon/android_core/android_tutorial_pubsub/build.gradle' (/home/hughie/.gradle/caches/1.0-milestone-9/scripts/build_74tnttb52qlgnvh83og6q53b66/ProjectScript/buildscript).
    11:22:46.770 [DEBUG] [org.gradle.cache.internal.DefaultFileLockManager] Releasing lock on no_buildscript class cache for build file '/opt/rocon/android_core/android_tutorial_image_transport/build.gradle' (/home/hughie/.gradle/caches/1.0-milestone-9/scripts/build_5v1njm98khr8pint7n2h88uajb/ProjectScript/no_buildscript).
    11:22:46.771 [DEBUG] [org.gradle.cache.internal.DefaultFileLockManager] Releasing lock on buildscript class cache for build file '/opt/rocon/android_core/android_tutorial_image_transport/build.gradle' (/home/hughie/.gradle/caches/1.0-milestone-9/scripts/build_5v1njm98khr8pint7n2h88uajb/ProjectScript/buildscript).
    11:22:46.771 [DEBUG] [org.gradle.cache.internal.DefaultFileLockManager] Releasing lock on no_buildscript class cache for build file '/opt/rocon/android_core/android_tutorial_hokuyo/build.gradle' (/home/hughie/.gradle/caches/1.0-milestone-9/scripts/build_1gatu8rrea7sa5lrepih2n3tav/ProjectScript/no_buildscript).
    11:22:46.771 [DEBUG] [org.gradle.cache.internal.DefaultFileLockManager] Releasing lock on buildscript class cache for build file '/opt/rocon/android_core/android_tutorial_hokuyo/build.gradle' (/home/hughie/.gradle/caches/1.0-milestone-9/scripts/build_1gatu8rrea7sa5lrepih2n3tav/ProjectScript/buildscript).
    11:22:46.772 [DEBUG] [org.gradle.cache.internal.DefaultFileLockManager] Releasing lock on no_buildscript class cache for build file '/opt/rocon/android_core/android_tutorial_camera/build.gradle' (/home/hughie/.gradle/caches/1.0-milestone-9/scripts/build_20slhbkrh7afpl6dbsuq23tq7c/ProjectScript/no_buildscript).
    11:22:46.772 [DEBUG] [org.gradle.cache.internal.DefaultFileLockManager] Releasing lock on buildscript class cache for build file '/opt/rocon/android_core/android_tutorial_camera/build.gradle' (/home/hughie/.gradle/caches/1.0-milestone-9/scripts/build_20slhbkrh7afpl6dbsuq23tq7c/ProjectScript/buildscript).
    11:22:46.773 [DEBUG] [org.gradle.cache.internal.DefaultFileLockManager] Releasing lock on no_buildscript class cache for build file '/opt/rocon/android_core/android_honeycomb_mr2/build.gradle' (/home/hughie/.gradle/caches/1.0-milestone-9/scripts/build_4f3mf2192hrctfkvhr8mtgtfj9/ProjectScript/no_buildscript).
    11:22:46.773 [DEBUG] [org.gradle.cache.internal.DefaultFileLockManager] Releasing lock on buildscript class cache for build file '/opt/rocon/android_core/android_honeycomb_mr2/build.gradle' (/home/hughie/.gradle/caches/1.0-milestone-9/scripts/build_4f3mf2192hrctfkvhr8mtgtfj9/ProjectScript/buildscript).
    11:22:46.773 [DEBUG] [org.gradle.cache.internal.DefaultFileLockManager] Releasing lock on no_buildscript class cache for build file '/opt/rocon/android_core/android_gingerbread/build.gradle' (/home/hughie/.gradle/caches/1.0-milestone-9/scripts/build_6nsu5kjcc710v0fhisjqj8cj4i/ProjectScript/no_buildscript).
    11:22:46.774 [DEBUG] [org.gradle.cache.internal.DefaultFileLockManager] Releasing lock on buildscript class cache for build file '/opt/rocon/android_core/android_gingerbread/build.gradle' (/home/hughie/.gradle/caches/1.0-milestone-9/scripts/build_6nsu5kjcc710v0fhisjqj8cj4i/ProjectScript/buildscript).
    11:22:46.774 [DEBUG] [org.gradle.cache.internal.DefaultFileLockManager] Releasing lock on no_buildscript class cache for build file '/opt/rocon/android_core/android_acm_serial/build.gradle' (/home/hughie/.gradle/caches/1.0-milestone-9/scripts/build_6mae2j2n6dab47iva0bq67qsn4/ProjectScript/no_buildscript).
    11:22:46.774 [DEBUG] [org.gradle.cache.internal.DefaultFileLockManager] Releasing lock on buildscript class cache for build file '/opt/rocon/android_core/android_acm_serial/build.gradle' (/home/hughie/.gradle/caches/1.0-milestone-9/scripts/build_6mae2j2n6dab47iva0bq67qsn4/ProjectScript/buildscript).
    11:22:46.775 [DEBUG] [org.gradle.cache.internal.DefaultFileLockManager] Releasing lock on no_buildscript class cache for build file '/opt/rocon/android_core/build.gradle' (/home/hughie/.gradle/caches/1.0-milestone-9/scripts/build_1pa00du8hiur34lmu7d2fqce7p/ProjectScript/no_buildscript).
    11:22:46.775 [DEBUG] [org.gradle.cache.internal.DefaultFileLockManager] Releasing lock on buildscript class cache for build file '/opt/rocon/android_core/build.gradle' (/home/hughie/.gradle/caches/1.0-milestone-9/scripts/build_1pa00du8hiur34lmu7d2fqce7p/ProjectScript/buildscript).
    11:22:46.775 [DEBUG] [org.gradle.cache.internal.DefaultFileLockManager] Releasing lock on no_buildscript class cache for settings file '/opt/rocon/android_core/settings.gradle' (/home/hughie/.gradle/caches/1.0-milestone-9/scripts/settings_3f3rmjunu6mv8eobp3b99jmg8v/SettingsScript/no_buildscript).
    11:22:46.776 [DEBUG] [org.gradle.cache.internal.DefaultFileLockManager] Releasing lock on buildscript class cache for settings file '/opt/rocon/android_core/settings.gradle' (/home/hughie/.gradle/caches/1.0-milestone-9/scripts/settings_3f3rmjunu6mv8eobp3b99jmg8v/SettingsScript/buildscript).
    11:22:46.777 [DEBUG] [org.gradle.logging.internal.DefaultLoggingConfigurer] Finished configuring with level: DEBUG, configurers: [org.gradle.logging.internal.OutputEventRenderer@14e8cee, org.gradle.logging.internal.slf4j.Slf4jLoggingConfigurer@67064, org.gradle.logging.internal.JavaUtilLoggingConfigurer@bcda2d]
    11:22:46.778 [DEBUG] [org.gradle.launcher.daemon.server.exec.ExecuteBuild] The daemon has finished executing the build.
    11:22:46.778 [DEBUG] [org.gradle.launcher.daemon.server.exec.ReturnResult] Daemon is dispatching the build result: DaemonCommandResult[type=CommandFailure, value=org.gradle.launcher.exec.ReportedException: org.gradle.api.internal.LocationAwareException: Execution failed for task ':android_honeycomb_mr2:debug'.]
    11:22:46.854 [DEBUG] [org.gradle.launcher.daemon.client.DaemonClientInputForwarder] input forwarder stop requested
    11:22:46.855 [DEBUG] [org.gradle.launcher.daemon.client.DaemonClientInputForwarder] Dispatching close input message: CloseInput[id=1334888566855-2]

-

I have same error. this is my detailed error. My environments and logs are as below.

  • ROS electric
    • ant : 1.8.2
    • android SDK tools(R19)
    • Android 3.2, 3.1, 2.3.3 installed
  • DISTRIB_DESCRIPTION="Ubuntu 11.10"

    DISTRIB_DESCRIPTION = Ubuntu 11.10

 Localname                  S SCM  Version-Spec               UID  (Spec)  URI  (Spec) (https://...)
  ---------                  - ---- ------------               -----------  -------------------------
  google                       hg   default                    74f72f400c60 code.google.com/p/rosjava.google
  android_core               M hg   default                    d06d044d3d57 code.google.com/p/rosjava.android
  rosjava_android            M hg                              d06d044d3d57 code.google.com/p/rosjava.android
  rosjava_core                 hg                              c8b056520989 rosjava.googlecode.com/hg

rosjava.googlecode.com/hg

   11:22:44.249 [QUIET] [system.out] Buildfile: /opt/rocon/android_core/android_honeycomb_mr2/build.xml
    11:22:44.781 [QUIET] [system.out] 
    11:22:44.781 [QUIET] [system.out] -set-mode-check:
    11:22:44.782 [QUIET] [system.out] 
    11:22:44.782 [QUIET] [system.out] -set-debug-files:
    11:22:44.782 [QUIET] [system.out] 
    11:22:44.783 [QUIET] [system.out] -set-debug-mode:
    11:22:44.783 [QUIET] [system.out] 
    11:22:44.783 [QUIET] [system.out] -debug-obfuscation-check:
    11:22:44.784 [QUIET] [system.out] 
    11:22:44.784 [QUIET] [system.out] -setup:
    11:22:44.792 [QUIET] [system.out]      [echo] Creating output directories if needed...
    11:22:44.794 [QUIET] [system.out]      [echo] Gathering info for android_honeycomb_mr2...
    11:22:44.797 [QUIET] [system.out]     [setup] Android SDK Tools Revision 19
    11:22:44.839 [QUIET] [system.out]     [setup] Project Target: Android 3.2
    11:22:44.840 [QUIET] [system.out]     [setup] API level: 13
    11:22:44.840 [QUIET] [system.out]     [setup] Project Type: Android Library
    11:22:44.840 [QUIET] [system.out]     [setup] 
    11:22:44.841 [QUIET] [system.out]     [setup] ------------------
    11:22:44.841 [QUIET] [system.out]     [setup] Resolving library dependencies:
    11:22:44.842 [QUIET] [system.out]     [setup] /opt/rocon/android_core/android_honeycomb_mr2: ../android_gingerbread => /opt/rocon/android_core/android_gingerbread
    11:22:44.844 [QUIET] [system.out]     [setup] ------------------
    11:22:44.844 [QUIET] [system.out]     [setup] Ordered libraries:
    11:22:44.845 [QUIET] [system.out]     [setup] /opt/rocon/android_core/android_gingerbread
    11:22:44.904 [QUIET] [system.out]     [setup] 
    11:22:44.905 [QUIET] [system.out]     [setup] ------------------
    11:22:44.905 [QUIET] [system.out]     [setup] API<=15: Adding annotations.jar to the classpath.
    11:22:44.905 [QUIET] [system.out]     [setup] 
    11:22:44.906 [QUIET] [system.out]     [setup] ------------------
    11:22:44.929 [QUIET] [system.out] 
    11:22:44.930 [QUIET] [system.out] -build-setup:
    11:22:44.932 [QUIET] [system.out]      [echo] Building Libraries
    11:22:45.043 [QUIET] [system.out] 
    11:22:45.043 [QUIET] [system.out] nodeps:
    11:22:45.044 [QUIET] [system.out] 
    11:22:45.044 [QUIET] [system.out] -set-mode-check:
    11:22:45.044 [QUIET] [system.out] 
    11:22:45.044 [QUIET] [system.out] -set-debug-files:
    11:22:45.044 [QUIET] [system.out] 
    11:22:45.045 [QUIET] [system.out] -set-debug-mode:
    11:22:45.045 [QUIET] [system.out] 
    11:22:45.045 [QUIET] [system.out] -debug-obfuscation-check:
    11:22:45.045 [QUIET] [system.out] 
    11:22:45.045 [QUIET] [system.out] -setup:
    11:22:45.046 [QUIET] [system.out]      [echo] Creating output directories if needed...
    11:22:45.046 [QUIET] [system.out]      [echo] Gathering info for android_gingerbread...
    11:22:45.047 [QUIET] [system.out]     [setup] Android SDK Tools Revision 19
    11:22:45.071 [QUIET] [system.out]     [setup] Project Target: Android 2.3.3
    11:22:45.071 [QUIET] [system.out]     [setup] API level: 10
    11:22:45.072 [QUIET] [system.out]     [setup] Project Type: Android Library
    11:22:45.072 [QUIET] [system.out]     [setup] 
    11:22:45.072 [QUIET] [system.out]     [setup] ------------------
    11:22:45.072 [QUIET] [system.out]     [setup] Resolving library dependencies:
    11:22:45.072 [QUIET] [system.out]     [setup] No library dependencies.
    11:22:45.073 [QUIET] [system.out]     [setup] 
    11:22:45.073 [QUIET] [system.out]     [setup] ------------------
    11:22:45.073 [QUIET] [system.out]     [setup] API<=15: Adding annotations.jar to the classpath.
    11:22:45.073 [QUIET] [system.out]     [setup] 
    11:22:45.073 [QUIET] [system.out]     [setup] ------------------
    11:22:45.085 [QUIET] [system.out] 
    11:22:45.085 [QUIET] [system.out] -build-setup:
    11:22:45.093 [QUIET] [system.out] 
    11:22:45.093 [QUIET] [system.out] -pre-build:
    11:22:45.094 [QUIET] [system.out] 
    11:22:45.094 [QUIET] [system.out] -code-gen:
    11:22:45.094 [QUIET] [system.out]      [echo] ----------
    11:22:45.094 [QUIET] [system.out]      [echo] Handling aidl files...
    11:22:45.107 [QUIET] [system.out]      [aidl] No AIDL files to compile.
    11:22:45.107 [QUIET] [system.out]      [echo] ----------
    11:22:45.107 [QUIET] [system.out]      [echo] Handling RenderScript files...
    11:22:45.115 [QUIET] [system.out] [renderscript] No RenderScript files to compile.
    11:22:45.115 [QUIET] [system.out]      [echo] ----------
    11:22:45.116 [QUIET] [system.out]      [echo] Handling Resources...
    11:22:45.126 [QUIET] [system.out]      [aapt] No changed resources. R.java and Manifest.java untouched.
    11:22:45.126 [QUIET] [system.out]      [echo] ----------
    11:22:45.126 [QUIET] [system.out]      [echo] Handling BuildConfig class...
    11:22:45.133 [QUIET] [system.out] [buildconfig] No need to generate new BuildConfig.
    11:22:45.133 [QUIET] [system.out] 
    11:22:45.134 [QUIET] [system.out] -pre-compile:
    11:22:45.134 [QUIET] [system.out] 
    11:22:45.134 [QUIET] [system.out] -compile:
    11:22:45.180 [QUIET] [system.out]      [echo] Creating library output jar file...
    11:22:45.227 [QUIET] [system.out] 
    11:22:45.227 [QUIET] [system.out] -post-compile:
    11:22:45.227 [QUIET] [system.out] 
    11:22:45.227 [QUIET] [system.out] -obfuscate:
    11:22:45.227 [QUIET] [system.out] 
    11:22:45.228 [QUIET] [system.out] -dex:
    11:22:45.228 [QUIET] [system.out]      [echo] Library project: do not convert bytecode...
    11:22:45.228 [QUIET] [system.out] 
    11:22:45.228 [QUIET] [system.out] -crunch:
    11:22:45.252 [QUIET] [system.out]    [crunch] Crunching PNG Files in source dir: /opt/rocon/android_core/android_gingerbread/res
    11:22:45.252 [QUIET] [system.out]    [crunch] To destination dir: /opt/rocon/android_core/android_gingerbread/bin/res
    11:22:45.252 [QUIET] [system.out]    [crunch] Crunched 0 PNG files to update cache
    11:22:45.654 [QUIET] [system.out] 
    11:22:45.655 [QUIET] [system.out] -package-resources:
    11:22:45.659 [QUIET] [system.out]      [echo] Library project: do not package resources...
    11:22:45.660 [QUIET] [system.out] 
    11:22:45.660 [QUIET] [system.out] -package:
    11:22:45.660 [QUIET] [system.out]      [echo] Library project: do not package apk...
    11:22:45.661 [QUIET] [system.out] 
    11:22:45.661 [QUIET] [system.out] -post-package:
    11:22:45.661 [QUIET] [system.out] 
    11:22:45.661 [QUIET] [system.out] -do-debug:
    11:22:45.661 [QUIET] [system.out]      [echo] Library project: do not create apk...
    11:22:45.667 [QUIET] [system.out] [propertyfile] Updating property file: /opt/rocon/android_core/android_gingerbread/bin/build.prop
    11:22:45.676 [QUIET] [system.out] [propertyfile] Updating property file: /opt/rocon/android_core/android_gingerbread/bin/build.prop
    11:22:45.678 [QUIET] [system.out] [propertyfile] Updating property file: /opt/rocon/android_core/android_gingerbread/bin/build.prop
    11:22:45.681 [QUIET] [system.out] [propertyfile] Updating property file: /opt/rocon/android_core/android_gingerbread/bin/build.prop
    11:22:45.683 [QUIET] [system.out] 
    11:22:45.683 [QUIET] [system.out] -post-build:
    11:22:45.683 [QUIET] [system.out] 
    11:22:45.684 [QUIET] [system.out] debug:
    11:22:45.684 [QUIET] [system.out]      [echo] 
    11:22:45.684 [QUIET] [system.out]      [echo] ############################################
    11:22:45.684 [QUIET] [system.out]      [echo] **** Back to project android_honeycomb_mr2 ****
    11:22:45.685 [QUIET] [system.out]      [echo] ############################################
    11:22:45.689 [QUIET] [system.out] 
    11:22:45.689 [QUIET] [system.out] -pre-build:
    11:22:45.690 [QUIET] [system.out] 
    11:22:45.690 [QUIET] [system.out] -code-gen:
    11:22:45.690 [QUIET] [system.out]      [echo] ----------
    11:22:45.690 [QUIET] [system.out]      [echo] Handling aidl files...
    11:22:45.699 [QUIET] [system.out]      [aidl] No AIDL files to compile.
    11:22:45.699 [QUIET] [system.out]      [echo] ----------
    11:22:45.699 [QUIET] [system.out]      [echo] Handling RenderScript files...
    11:22:45.708 [QUIET] [system.out] [renderscript] No RenderScript files to compile.
    11:22:45.709 [QUIET] [system.out]      [echo] ----------
    11:22:45.709 [QUIET] [system.out]      [echo] Handling Resources...
    11:22:45.716 [QUIET] [system.out]      [aapt] No changed resources. R.java and Manifest.java untouched.
    11:22:45.717 [QUIET] [system.out]      [echo] ----------
    11:22:45.717 [QUIET] [system.out]      [echo] Handling BuildConfig class...
    11:22:45.720 [QUIET] [system.out] [buildconfig] Generating BuildConfig class.
    11:22:45.721 [QUIET] [system.out] 
    11:22:45.722 [QUIET] [system.out] -pre-compile:
    11:22:45.722 [QUIET] [system.out] 
    11:22:45.722 [QUIET] [system.out] -compile:
    11:22:45.743 [QUIET] [system.out]     [javac] Compiling 41 source files to /opt/rocon/android_core/android_honeycomb_mr2/bin/classes
    11:22:46.466 [QUIET] [system.out]     [javac] /opt/rocon/android_core/android_honeycomb_mr2/src/org/ros/android/view/visualization/layer/CompressedBitmapLayer.java:42: package compressed_visualization_transport_msgs does not exist
    11:22:46.466 [QUIET] [system.out]     [javac]     SubscriberLayer<compressed_visualization_transport_msgs.CompressedBitmap> implements TfLayer {
    11:22:46.467 [QUIET] [system.out]     [javac]                                                            ^
    11:22:46.467 [QUIET] [system.out]     [javac] /opt/rocon/android_core/android_honeycomb_mr2/src/org/ros/android/view/visualization/layer/CompressedBitmapLayer.java:85: package compressed_visualization_transport_msgs does not exist
    11:22:46.467 [QUIET] [system.out]     [javac]   void update(compressed_visualization_transport_msgs.CompressedBitmap compressedBitmap) {
    11:22:46.468 [QUIET] [system.out]     [javac]                                                      ^
    11:22:46.610 [QUIET] [system.out]     [javac] /opt/rocon/android_core/android_honeycomb_mr2/src/org/ros/android/view/visualization/layer/CompressedBitmapLayer.java:72: package compressed_visualization_transport_msgs does not exist
    11:22:46.610 [QUIET] [system.out]     [javac]     Subscriber<compressed_visualization_transport_msgs.CompressedBitmap> subscriber =
    11:22:46.610 [QUIET] [system.out]     [javac]                                                       ^
    11:22:46.611 [QUIET] [system.out]     [javac] /opt/rocon/android_core/android_honeycomb_mr2/src/org/ros/android/view/visualization/layer/CompressedBitmapLayer.java:76: package compressed_visualization_transport_msgs does not exist
    11:22:46.611 [QUIET] [system.out]     [javac]         .addMessageListener(new MessageListener<compressed_visualization_transport_msgs.CompressedBitmap>() {
    11:22:46.611 [QUIET] [system.out]     [javac]                                                                                        ^
    11:22:46.611 [QUIET] [system.out]     [javac] /opt/rocon/android_core/android_honeycomb_mr2/src/org/ros/android/view/visualization/layer/CompressedBitmapLayer.java:79: package compressed_visualization_transport_msgs does not exist
    11:22:46.611 [QUIET] [system.out]     [javac]               compressed_visualization_transport_msgs.CompressedBitmap compressedBitmap) {
    11:22:46.612 [QUIET] [system.out]     [javac]                                                      ^
    11:22:46.648 [QUIET] [system.out]     [javac] 5 errors
    11:22:46.649 [ERROR] [system.err] 
    11:22:46.649 [ERROR] [system.err] BUILD FAILED
    11:22:46.649 [ERROR] [system.err] /opt/android-sdk-linux_x86/tools/ant/build.xml:651: The following error occurred while executing this line:
    11:22:46.649 [ERROR] [system.err] /opt/android-sdk-linux_x86/tools/ant/build.xml:672: Compile failed; see the compiler error output for details.
    11:22:46.650 [ERROR] [system.err] 
    11:22:46.650 [ERROR] [system.err] Total time: 2 seconds
    11:22:46.728 [DEBUG] [org.gradle.process.internal.DefaultExecHandle] Process finished (code: 1) for command 'ant'.
    11:22:46.729 [DEBUG] [org.gradle.logging.internal.DefaultLoggingConfigurer] Finished configuring with level: DEBUG, configurers: [org.gradle.logging.internal.OutputEventRenderer@14e8cee, org.gradle.logging.internal.slf4j.Slf4jLoggingConfigurer@67064, org.gradle.logging.internal.JavaUtilLoggingConfigurer@bcda2d]
    11:22:46.730 [DEBUG] [org.gradle.api.internal.tasks.execution.ExecuteAtMostOnceTaskExecuter] Finished executing task ':android_honeycomb_mr2:debug'
    11:22:46.732 [ERROR] [org.gradle.BuildExceptionReporter] 
    11:22:46.733 [ERROR] [org.gradle.BuildExceptionReporter] FAILURE: Build failed with an exception.
    11:22:46.734 [ERROR] [org.gradle.BuildExceptionReporter] 
    11:22:46.735 [ERROR] [org.gradle.BuildExceptionReporter] * What went wrong:
    11:22:46.735 [ERROR] [org.gradle.BuildExceptionReporter] Execution failed for task ':android_honeycomb_mr2:debug'.
    11:22:46.736 [ERROR] [org.gradle.BuildExceptionReporter] > Command 'ant' finished with (non-zero) exit value 1.
    11:22:46.736 [ERROR] [org.gradle.BuildExceptionReporter] 
    11:22:46.736 [ERROR] [org.gradle.BuildExceptionReporter] * Exception is:
    11:22:46.737 [ERROR] [org.gradle.BuildExceptionReporter] org.gradle.api.tasks.TaskExecutionException: Execution failed for task ':android_honeycomb_mr2:debug'.
    11:22:46.737 [ERROR] [org.gradle.BuildExceptionReporter]    at org.gradle.api.internal.tasks.execution.ExecuteActionsTaskExecuter.executeActions(ExecuteActionsTaskExecuter.java:68)
    11:22:46.738 [ERROR] [org.gradle.BuildExceptionReporter]    at org.gradle.api.internal.tasks.execution.ExecuteActionsTaskExecuter.execute(ExecuteActionsTaskExecuter.java:46)
    11:22:46.738 [ERROR] [org.gradle.BuildExceptionReporter]    at org.gradle.api.internal.tasks.execution.PostExecutionAnalysisTaskExecuter.execute(PostExecutionAnalysisTaskExecuter.java:34)
    11:22:46.738 [ERROR] [org.gradle.BuildExceptionReporter]    at org.gradle.api.internal.changedetection.CacheLockHandlingTaskExecuter$1.run(CacheLockHandlingTaskExecuter.java:34)
    11:22:46.738 [ERROR] [org.gradle.BuildExceptionReporter]    at org.gradle.cache.internal.DefaultCacheAccess$2.create(DefaultCacheAccess.java:200)
    11:22:46.739 [ERROR] [org.gradle.BuildExceptionReporter]    at org.gradle.cache.internal.DefaultCacheAccess.longRunningOperation(DefaultCacheAccess.java:172)
    11:22:46.739 [ERROR] [org.gradle.BuildExceptionReporter]    at org.gradle.cache.internal.DefaultCacheAccess.longRunningOperation(DefaultCacheAccess.java:198)
    11:22:46.739 [ERROR] [org.gradle.BuildExceptionReporter]    at org.gradle.cache.internal.DefaultPersistentDirectoryStore.longRunningOperation(DefaultPersistentDirectoryStore.java:111)
    11:22:46.739 [ERROR] [org.gradle.BuildExceptionReporter]    at org.gradle.api.internal.changedetection.DefaultTaskArtifactStateCacheAccess.longRunningOperation(DefaultTaskArtifactStateCacheAccess.java:83)
    11:22:46.740 [ERROR] [org.gradle.BuildExceptionReporter]    at org.gradle.api.internal.changedetection.CacheLockHandlingTaskExecuter.execute(CacheLockHandlingTaskExecuter.java:32)
    11:22:46.740 [ERROR] [org.gradle.BuildExceptionReporter]    at org.gradle.api.internal.tasks.execution.SkipUpToDateTaskExecuter.execute(SkipUpToDateTaskExecuter.java:55)
    11:22:46.740 [ERROR] [org.gradle.BuildExceptionReporter]    at org.gradle.api.internal.tasks.execution.ValidatingTaskExecuter.execute(ValidatingTaskExecuter.java:57)
    11:22:46.741 [ERROR] [org.gradle.BuildExceptionReporter]    at org.gradle.api.internal.tasks.execution.SkipEmptySourceFilesTaskExecuter.execute(SkipEmptySourceFilesTaskExecuter.java:41)
    11:22:46.741 [ERROR] [org.gradle.BuildExceptionReporter]    at org.gradle.api.internal.tasks.execution.SkipTaskWithNoActionsExecuter.execute(SkipTaskWithNoActionsExecuter.java:51)
    11:22:46.741 [ERROR] [org.gradle.BuildExceptionReporter]    at org.gradle.api.internal.tasks.execution.SkipOnlyIfTaskExecuter.execute(SkipOnlyIfTaskExecuter.java:52)
    11:22:46.742 [ERROR] [org.gradle.BuildExceptionReporter]    at org.gradle.api.internal.tasks.execution.ExecuteAtMostOnceTaskExecuter.execute(ExecuteAtMostOnceTaskExecuter.java:42)
    11:22:46.742 [ERROR] [org.gradle.BuildExceptionReporter]    at org.gradle.api.internal.AbstractTask.executeWithoutThrowingTaskFailure(AbstractTask.java:247)
    11:22:46.743 [ERROR] [org.gradle.BuildExceptionReporter]    at org.gradle.execution.DefaultTaskGraphExecuter.executeTask(DefaultTaskGraphExecuter.java:192)
    11:22:46.743 [ERROR] [org.gradle.BuildExceptionReporter]    at org.gradle.execution.DefaultTaskGraphExecuter.doExecute(DefaultTaskGraphExecuter.java:177)
    11:22:46.743 [ERROR] [org.gradle.BuildExceptionReporter]    at org.gradle.execution.DefaultTaskGraphExecuter.execute(DefaultTaskGraphExecuter.java:83)
    11:22:46.744 [ERROR] [org.gradle.BuildExceptionReporter]    at org.gradle.execution.SelectedTaskExecutionAction.execute(SelectedTaskExecutionAction.java:36)
    11:22:46.744 [ERROR] [org.gradle.BuildExceptionReporter]    at org.gradle.execution.DefaultBuildExecuter.execute(DefaultBuildExecuter.java:61)
    11:22:46.745 [ERROR] [org.gradle.BuildExceptionReporter]    at org.gradle.execution.DefaultBuildExecuter.access$200(DefaultBuildExecuter.java:23)
    11:22:46.745 [ERROR] [org.gradle.BuildExceptionReporter]    at org.gradle.execution.DefaultBuildExecuter$2.proceed(DefaultBuildExecuter.java:67)
    11:22:46.746 [ERROR] [org.gradle.BuildExceptionReporter]    at org.gradle.api.internal.changedetection.TaskCacheLockHandlingBuildExecuter$1.run(TaskCacheLockHandlingBuildExecuter.java:31)
    11:22:46.746 [ERROR] [org.gradle.BuildExceptionReporter]    at org.gradle.cache.internal.DefaultCacheAccess$1.create(DefaultCacheAccess.java:111)
    11:22:46.746 [ERROR] [org.gradle.BuildExceptionReporter]    at org.gradle.cache.internal.DefaultCacheAccess.useCache(DefaultCacheAccess.java:126)
    11:22:46.747 [ERROR] [org.gradle.BuildExceptionReporter]    at org.gradle.cache.internal.DefaultCacheAccess.useCache(DefaultCacheAccess.java:109)
    11:22:46.747 [ERROR] [org.gradle.BuildExceptionReporter]    at org.gradle.cache.internal.DefaultPersistentDirectoryStore.useCache(DefaultPersistentDirectoryStore.java:103)
    11:22:46.747 [ERROR] [org.gradle.BuildExceptionReporter]    at org.gradle.api.internal.changedetection.DefaultTaskArtifactStateCacheAccess.useCache(DefaultTaskArtifactStateCacheAccess.java:79)
    11:22:46.747 [ERROR] [org.gradle.BuildExceptionReporter]    at org.gradle.api.internal.changedetection.TaskCacheLockHandlingBuildExecuter.execute(TaskCacheLockHandlingBuildExecuter.java:29)
    11:22:46.748 [ERROR] [org.gradle.BuildExceptionReporter]    at org.gradle.execution.DefaultBuildExecuter.execute(DefaultBuildExecuter.java:61)
    11:22:46.748 [ERROR] [org.gradle.BuildExceptionReporter]    at org.gradle.execution.DefaultBuildExecuter.access$200(DefaultBuildExecuter.java:23)
    11:22:46.748 [ERROR] [org.gradle.BuildExceptionReporter]    at org.gradle.execution.DefaultBuildExecuter$2.proceed(DefaultBuildExecuter.java:67)
    11:22:46.749 [ERROR] [org.gradle.BuildExceptionReporter]    at org.gradle.execution.DryRunBuildExecutionAction.execute(DryRunBuildExecutionAction.java:32)
    11:22:46.749 [ERROR] [org.gradle.BuildExceptionReporter]    at org.gradle.execution.DefaultBuildExecuter.execute(DefaultBuildExecuter.java:61)
    11:22:46.749 [ERROR] [org.gradle.BuildExceptionReporter]    at org.gradle.execution.DefaultBuildExecuter.execute(DefaultBuildExecuter.java:54)
    11:22:46.749 [ERROR] [org.gradle.BuildExceptionReporter]    at org.gradle.initialization.DefaultGradleLauncher.doBuildStages(DefaultGradleLauncher.java:155)
    11:22:46.750 [ERROR] [org.gradle.BuildExceptionReporter]    at org.gradle.initialization.DefaultGradleLauncher.doBuild(DefaultGradleLauncher.java:110)
    11:22:46.750 [ERROR] [org.gradle.BuildExceptionReporter]    at org.gradle.initialization.DefaultGradleLauncher.run(DefaultGradleLauncher.java:78)
    11:22:46.750 [ERROR] [org.gradle.BuildExceptionReporter]    at org.gradle.launcher.cli.ExecuteBuildAction.run(ExecuteBuildAction.java:45)
    11:22:46.751 [ERROR] [org.gradle.BuildExceptionReporter]    at org.gradle.launcher.daemon.protocol.Build.run(Build.java:67)
    11:22:46.751 [ERROR] [org.gradle.BuildExceptionReporter]    at org.gradle.launcher.daemon.protocol.Build.run(Build.java:63)
    11:22:46.751 [ERROR] [org.gradle.BuildExceptionReporter]    at org.gradle.launcher.daemon.server.exec.ExecuteBuild.doBuild(ExecuteBuild.java:45)
    11:22:46.751 [ERROR] [org.gradle.BuildExceptionReporter]    at org.gradle.launcher.daemon.server.exec.BuildCommandOnly.execute(BuildCommandOnly.java:34)
    11:22:46.752 [ERROR] [org.gradle.BuildExceptionReporter]    at org.gradle.launcher.daemon.server.exec.DaemonCommandExecution.proceed(DaemonCommandExecution.java:122)
    11:22:46.752 [ERROR] [org.gradle.BuildExceptionReporter]    at org.gradle.launcher.daemon.server.exec.WatchForDisconnection.execute(WatchForDisconnection.java:45)
    11:22:46.752 [ERROR] [org.gradle.BuildExceptionReporter]    at org.gradle.launcher.daemon.server.exec.DaemonCommandExecution.proceed(DaemonCommandExecution.java:122)
    11:22:46.753 [ERROR] [org.gradle.BuildExceptionReporter]    at org.gradle.launcher.daemon.server.exec.ResetDeprecationLogger.execute(ResetDeprecationLogger.java:24)
    11:22:46.753 [ERROR] [org.gradle.BuildExceptionReporter]    at org.gradle.launcher.daemon.server.exec.DaemonCommandExecution.proceed(DaemonCommandExecution.java:122)
    11:22:46.753 [ERROR] [org.gradle.BuildExceptionReporter]    at org.gradle.launcher.daemon.server.exec.ReturnResult.execute(ReturnResult.java:34)
    11:22:46.753 [ERROR] [org.gradle.BuildExceptionReporter]    at org.gradle.launcher.daemon.server.exec.DaemonCommandExecution.proceed(DaemonCommandExecution.java:122)
    11:22:46.754 [ERROR] [org.gradle.BuildExceptionReporter]    at org.gradle.launcher.daemon.server.exec.ForwardClientInput$4.call(ForwardClientInput.java:116)
    11:22:46.754 [ERROR] [org.gradle.BuildExceptionReporter]    at org.gradle.launcher.daemon.server.exec.ForwardClientInput$4.call(ForwardClientInput.java:114)
    11:22:46.754 [ERROR] [org.gradle.BuildExceptionReporter]    at org.gradle.util.Swapper.swap(Swapper.java:38)
    11:22:46.754 [ERROR] [org.gradle.BuildExceptionReporter]    at org.gradle.launcher.daemon.server.exec.ForwardClientInput.execute(ForwardClientInput.java:114)
    11:22:46.755 [ERROR] [org.gradle.BuildExceptionReporter]    at org.gradle.launcher.daemon.server.exec.DaemonCommandExecution.proceed(DaemonCommandExecution.java:122)
    11:22:46.755 [ERROR] [org.gradle.BuildExceptionReporter]    at org.gradle.launcher.daemon.server.exec.LogToClient.doBuild(LogToClient.java:60)
    11:22:46.755 [ERROR] [org.gradle.BuildExceptionReporter]    at org.gradle.launcher.daemon.server.exec.BuildCommandOnly.execute(BuildCommandOnly.java:34)
    11:22:46.755 [ERROR] [org.gradle.BuildExceptionReporter]    at org.gradle.launcher.daemon.server.exec.DaemonCommandExecution.proceed(DaemonCommandExecution.java:122)
    11:22:46.756 [ERROR] [org.gradle.BuildExceptionReporter]    at org.gradle.launcher.daemon.server.exec.EstablishBuildEnvironment.doBuild(EstablishBuildEnvironment.java:61)
    11:22:46.756 [ERROR] [org.gradle.BuildExceptionReporter]    at org.gradle.launcher.daemon.server.exec.BuildCommandOnly.execute(BuildCommandOnly.java:34)
    11:22:46.756 [ERROR] [org.gradle.BuildExceptionReporter]    at org.gradle.launcher.daemon.server.exec.DaemonCommandExecution.proceed(DaemonCommandExecution.java:122)
    11:22:46.757 [ERROR] [org.gradle.BuildExceptionReporter]    at org.gradle.launcher.daemon.server.exec.StartBuildOrRespondWithBusy.doBuild(StartBuildOrRespondWithBusy.java:49)
    11:22:46.757 [ERROR] [org.gradle.BuildExceptionReporter]    at org.gradle.launcher.daemon.server.exec.BuildCommandOnly.execute(BuildCommandOnly.java:34)
    11:22:46.757 [ERROR] [org.gradle.BuildExceptionReporter]    at org.gradle.launcher.daemon.server.exec.DaemonCommandExecution.proceed(DaemonCommandExecution.java:122)
    11:22:46.757 [ERROR] [org.gradle.BuildExceptionReporter]    at org.gradle.launcher.daemon.server.exec.HandleStop.execute(HandleStop.java:36)
    11:22:46.758 [ERROR] [org.gradle.BuildExceptionReporter]    at org.gradle.launcher.daemon.server.exec.DaemonCommandExecution.proceed(DaemonCommandExecution.java:122)
    11:22:46.758 [ERROR] [org.gradle.BuildExceptionReporter]    at org.gradle.launcher.daemon.server.exec.CatchAndForwardDaemonFailure.execute(CatchAndForwardDaemonFailure.java:32)
    11:22:46.758 [ERROR] [org.gradle.BuildExceptionReporter]    at org.gradle.launcher.daemon.server.exec.DaemonCommandExecution.proceed(DaemonCommandExecution.java:122)
    11:22:46.758 [ERROR] [org.gradle.BuildExceptionReporter]    at org.gradle.launcher.daemon.server.exec.HandleClientDisconnectBeforeSendingCommand.execute(HandleClientDisconnectBeforeSendingCommand.java:21)
    11:22:46.759 [ERROR] [org.gradle.BuildExceptionReporter]    at org.gradle.launcher.daemon.server.exec.DaemonCommandExecution.proceed(DaemonCommandExecution.java:122)
    11:22:46.759 [ERROR] [org.gradle.BuildExceptionReporter]    at org.gradle.launcher.daemon.server.exec.StopConnectionAfterExecution.execute(StopConnectionAfterExecution.java:27)
    11:22:46.759 [ERROR] [org.gradle.BuildExceptionReporter]    at org.gradle.launcher.daemon.server.exec.DaemonCommandExecution.proceed(DaemonCommandExecution.java:122)
    11:22:46.760 [ERROR] [org.gradle.BuildExceptionReporter]    at org.gradle.launcher.daemon.server.exec.DefaultDaemonCommandExecuter.executeCommand(DefaultDaemonCommandExecuter.java:55)
    11:22:46.760 [ERROR] [org.gradle.BuildExceptionReporter]    at org.gradle.launcher.daemon.server.Daemon$1$1.run(Daemon.java:123)
    11:22:46.760 [ERROR] [org.gradle.BuildExceptionReporter]    at org.gradle.messaging.concurrent.DefaultExecutorFactory$StoppableExecutorImpl$1.run(DefaultExecutorFactory.java:66)
    11:22:46.760 [ERROR] [org.gradle.BuildExceptionReporter] Caused by: org.gradle.process.internal.ExecException: Command 'ant' finished with (non-zero) exit value 1.
    11:22:46.761 [ERROR] [org.gradle.BuildExceptionReporter]    at org.gradle.process.internal.DefaultExecHandle$ExecResultImpl.assertNormalExitValue(DefaultExecHandle.java:338)
    11:22:46.761 [ERROR] [org.gradle.BuildExceptionReporter]    at org.gradle.process.internal.DefaultExecAction.execute(DefaultExecAction.java:39)
    11:22:46.761 [ERROR] [org.gradle.BuildExceptionReporter]    at org.gradle.api.tasks.Exec.exec(Exec.java:58)
    11:22:46.761 [ERROR] [org.gradle.BuildExceptionReporter]    at org.gradle.api.internal.BeanDynamicObject$MetaClassAdapter.invokeMethod(BeanDynamicObject.java:196)
    11:22:46.762 [ERROR] [org.gradle.BuildExceptionReporter]    at org.gradle.api.internal.BeanDynamicObject.invokeMethod(BeanDynamicObject.java:102)
    11:22:46.762 [ERROR] [org.gradle.BuildExceptionReporter]    at org.gradle.api.internal.CompositeDynamicObject.invokeMethod(CompositeDynamicObject.java:99)
    11:22:46.762 [ERROR] [org.gradle.BuildExceptionReporter]    at org.gradle.api.tasks.Exec_Decorated.invokeMethod(Unknown Source)
    11:22:46.763 [ERROR] [org.gradle.BuildExceptionReporter]    at org.gradle.util.ReflectionUtil.invoke(ReflectionUtil.groovy:23)
    11:22:46.763 [ERROR] [org.gradle.BuildExceptionReporter]    at org.gradle.api.internal.project.taskfactory.AnnotationProcessingTaskFactory$4.execute(AnnotationProcessingTaskFactory.java:150)
    11:22:46.763 [ERROR] [org.gradle.BuildExceptionReporter]    at org.gradle.api.internal.project.taskfactory.AnnotationProcessingTaskFactory$4.execute(AnnotationProcessingTaskFactory.java:145)
    11:22:46.764 [ERROR] [org.gradle.BuildExceptionReporter]    at org.gradle.api.internal.AbstractTask$TaskActionWrapper.execute(AbstractTask.java:477)
    11:22:46.764 [ERROR] [org.gradle.BuildExceptionReporter]    at org.gradle.api.internal.AbstractTask$TaskActionWrapper.execute(AbstractTask.java:466)
    11:22:46.764 [ERROR] [org.gradle.BuildExceptionReporter]    at org.gradle.api.internal.tasks.execution.ExecuteActionsTaskExecuter.executeActions(ExecuteActionsTaskExecuter.java:60)
    11:22:46.764 [ERROR] [org.gradle.BuildExceptionReporter]    ... 76 more
    11:22:46.765 [ERROR] [org.gradle.BuildExceptionReporter] 
    11:22:46.767 [LIFECYCLE] [org.gradle.BuildResultLogger] 
    11:22:46.767 [LIFECYCLE] [org.gradle.BuildResultLogger] BUILD FAILED
    11:22:46.768 [LIFECYCLE] [org.gradle.BuildResultLogger] 
    11:22:46.768 [LIFECYCLE] [org.gradle.BuildResultLogger] Total time: 6.52 secs
    11:22:46.768 [DEBUG] [org.gradle.cache.internal.DefaultFileLockManager] Releasing lock on no_buildscript class cache for build file '/opt/rocon/android_core/docs/build.gradle' (/home/hughie/.gradle/caches/1.0-milestone-9/scripts/build_peoaba3uu8690sulg51o9m3e3/ProjectScript/no_buildscript).
    11:22:46.769 [DEBUG] [org.gradle.cache.internal.DefaultFileLockManager] Releasing lock on buildscript class cache for build file '/opt/rocon/android_core/docs/build.gradle' (/home/hughie/.gradle/caches/1.0-milestone-9/scripts/build_peoaba3uu8690sulg51o9m3e3/ProjectScript/buildscript).
    11:22:46.769 [DEBUG] [org.gradle.cache.internal.DefaultFileLockManager] Releasing lock on no_buildscript class cache for build file '/opt/rocon/android_core/android_tutorial_teleop/build.gradle' (/home/hughie/.gradle/caches/1.0-milestone-9/scripts/build_6aa7jlhi8f5q2s40ie261oeu1m/ProjectScript/no_buildscript).
    11:22:46.769 [DEBUG] [org.gradle.cache.internal.DefaultFileLockManager] Releasing lock on buildscript class cache for build file '/opt/rocon/android_core/android_tutorial_teleop/build.gradle' (/home/hughie/.gradle/caches/1.0-milestone-9/scripts/build_6aa7jlhi8f5q2s40ie261oeu1m/ProjectScript/buildscript).
    11:22:46.770 [DEBUG] [org.gradle.cache.internal.DefaultFileLockManager] Releasing lock on no_buildscript class cache for build file '/opt/rocon/android_core/android_tutorial_pubsub/build.gradle' (/home/hughie/.gradle/caches/1.0-milestone-9/scripts/build_74tnttb52qlgnvh83og6q53b66/ProjectScript/no_buildscript).
    11:22:46.770 [DEBUG] [org.gradle.cache.internal.DefaultFileLockManager] Releasing lock on buildscript class cache for build file '/opt/rocon/android_core/android_tutorial_pubsub/build.gradle' (/home/hughie/.gradle/caches/1.0-milestone-9/scripts/build_74tnttb52qlgnvh83og6q53b66/ProjectScript/buildscript).
    11:22:46.770 [DEBUG] [org.gradle.cache.internal.DefaultFileLockManager] Releasing lock on no_buildscript class cache for build file '/opt/rocon/android_core/android_tutorial_image_transport/build.gradle' (/home/hughie/.gradle/caches/1.0-milestone-9/scripts/build_5v1njm98khr8pint7n2h88uajb/ProjectScript/no_buildscript).
    11:22:46.771 [DEBUG] [org.gradle.cache.internal.DefaultFileLockManager] Releasing lock on buildscript class cache for build file '/opt/rocon/android_core/android_tutorial_image_transport/build.gradle' (/home/hughie/.gradle/caches/1.0-milestone-9/scripts/build_5v1njm98khr8pint7n2h88uajb/ProjectScript/buildscript).
    11:22:46.771 [DEBUG] [org.gradle.cache.internal.DefaultFileLockManager] Releasing lock on no_buildscript class cache for build file '/opt/rocon/android_core/android_tutorial_hokuyo/build.gradle' (/home/hughie/.gradle/caches/1.0-milestone-9/scripts/build_1gatu8rrea7sa5lrepih2n3tav/ProjectScript/no_buildscript).
    11:22:46.771 [DEBUG] [org.gradle.cache.internal.DefaultFileLockManager] Releasing lock on buildscript class cache for build file '/opt/rocon/android_core/android_tutorial_hokuyo/build.gradle' (/home/hughie/.gradle/caches/1.0-milestone-9/scripts/build_1gatu8rrea7sa5lrepih2n3tav/ProjectScript/buildscript).
    11:22:46.772 [DEBUG] [org.gradle.cache.internal.DefaultFileLockManager] Releasing lock on no_buildscript class cache for build file '/opt/rocon/android_core/android_tutorial_camera/build.gradle' (/home/hughie/.gradle/caches/1.0-milestone-9/scripts/build_20slhbkrh7afpl6dbsuq23tq7c/ProjectScript/no_buildscript).
    11:22:46.772 [DEBUG] [org.gradle.cache.internal.DefaultFileLockManager] Releasing lock on buildscript class cache for build file '/opt/rocon/android_core/android_tutorial_camera/build.gradle' (/home/hughie/.gradle/caches/1.0-milestone-9/scripts/build_20slhbkrh7afpl6dbsuq23tq7c/ProjectScript/buildscript).
    11:22:46.773 [DEBUG] [org.gradle.cache.internal.DefaultFileLockManager] Releasing lock on no_buildscript class cache for build file '/opt/rocon/android_core/android_honeycomb_mr2/build.gradle' (/home/hughie/.gradle/caches/1.0-milestone-9/scripts/build_4f3mf2192hrctfkvhr8mtgtfj9/ProjectScript/no_buildscript).
    11:22:46.773 [DEBUG] [org.gradle.cache.internal.DefaultFileLockManager] Releasing lock on buildscript class cache for build file '/opt/rocon/android_core/android_honeycomb_mr2/build.gradle' (/home/hughie/.gradle/caches/1.0-milestone-9/scripts/build_4f3mf2192hrctfkvhr8mtgtfj9/ProjectScript/buildscript).
    11:22:46.773 [DEBUG] [org.gradle.cache.internal.DefaultFileLockManager] Releasing lock on no_buildscript class cache for build file '/opt/rocon/android_core/android_gingerbread/build.gradle' (/home/hughie/.gradle/caches/1.0-milestone-9/scripts/build_6nsu5kjcc710v0fhisjqj8cj4i/ProjectScript/no_buildscript).
    11:22:46.774 [DEBUG] [org.gradle.cache.internal.DefaultFileLockManager] Releasing lock on buildscript class cache for build file '/opt/rocon/android_core/android_gingerbread/build.gradle' (/home/hughie/.gradle/caches/1.0-milestone-9/scripts/build_6nsu5kjcc710v0fhisjqj8cj4i/ProjectScript/buildscript).
    11:22:46.774 [DEBUG] [org.gradle.cache.internal.DefaultFileLockManager] Releasing lock on no_buildscript class cache for build file '/opt/rocon/android_core/android_acm_serial/build.gradle' (/home/hughie/.gradle/caches/1.0-milestone-9/scripts/build_6mae2j2n6dab47iva0bq67qsn4/ProjectScript/no_buildscript).
    11:22:46.774 [DEBUG] [org.gradle.cache.internal.DefaultFileLockManager] Releasing lock on buildscript class cache for build file '/opt/rocon/android_core/android_acm_serial/build.gradle' (/home/hughie/.gradle/caches/1.0-milestone-9/scripts/build_6mae2j2n6dab47iva0bq67qsn4/ProjectScript/buildscript).
    11:22:46.775 [DEBUG] [org.gradle.cache.internal.DefaultFileLockManager] Releasing lock on no_buildscript class cache for build file '/opt/rocon/android_core/build.gradle' (/home/hughie/.gradle/caches/1.0-milestone-9/scripts/build_1pa00du8hiur34lmu7d2fqce7p/ProjectScript/no_buildscript).
    11:22:46.775 [DEBUG] [org.gradle.cache.internal.DefaultFileLockManager] Releasing lock on buildscript class cache for build file '/opt/rocon/android_core/build.gradle' (/home/hughie/.gradle/caches/1.0-milestone-9/scripts/build_1pa00du8hiur34lmu7d2fqce7p/ProjectScript/buildscript).
    11:22:46.775 [DEBUG] [org.gradle.cache.internal.DefaultFileLockManager] Releasing lock on no_buildscript class cache for settings file '/opt/rocon/android_core/settings.gradle' (/home/hughie/.gradle/caches/1.0-milestone-9/scripts/settings_3f3rmjunu6mv8eobp3b99jmg8v/SettingsScript/no_buildscript).
    11:22:46.776 [DEBUG] [org.gradle.cache.internal.DefaultFileLockManager] Releasing lock on buildscript class cache for settings file '/opt/rocon/android_core/settings.gradle' (/home/hughie/.gradle/caches/1.0-milestone-9/scripts/settings_3f3rmjunu6mv8eobp3b99jmg8v/SettingsScript/buildscript).
    11:22:46.777 [DEBUG] [org.gradle.logging.internal.DefaultLoggingConfigurer] Finished configuring with level: DEBUG, configurers: [org.gradle.logging.internal.OutputEventRenderer@14e8cee, org.gradle.logging.internal.slf4j.Slf4jLoggingConfigurer@67064, org.gradle.logging.internal.JavaUtilLoggingConfigurer@bcda2d]
    11:22:46.778 [DEBUG] [org.gradle.launcher.daemon.server.exec.ExecuteBuild] The daemon has finished executing the build.
    11:22:46.778 [DEBUG] [org.gradle.launcher.daemon.server.exec.ReturnResult] Daemon is dispatching the build result: DaemonCommandResult[type=CommandFailure, value=org.gradle.launcher.exec.ReportedException: org.gradle.api.internal.LocationAwareException: Execution failed for task ':android_honeycomb_mr2:debug'.]
    11:22:46.854 [DEBUG] [org.gradle.launcher.daemon.client.DaemonClientInputForwarder] input forwarder stop requested
    11:22:46.855 [DEBUG] [org.gradle.launcher.daemon.client.DaemonClientInputForwarder] Dispatching close input message: CloseInput[id=1334888566855-2]

-